<h4>Build status: FAILURE</h4>
Build worker for this Build: <b>opensuse423.yocto.io</b>
<br>
Complete logs for all build steps: <a href="https://autobuilder.yocto.io/builders/nightly-qa-extras/builds/813">https://autobuilder.yocto.io/builders/nightly-qa-extras/builds/813</a>
<br>
Build Reason: Triggerable(trigger_main-build_nowait)
<br>
Build Properties:<br>
<ul>
<li>Contents of bblayers.conf (Note. LCONF_VERSION will not show up correctly)<br><code>
POKY_BBLAYERS_CONF_VERSION = <PCONF> <br>
BBPATH = "${TOPDIR}" <br>
BBFILES ?="" <br>
BBLAYERS += " \ <br>
/home/pokybuild/yocto-autobuilder/yocto-worker/nightly-qa-extras/build/meta \ <br>
/home/pokybuild/yocto-autobuilder/yocto-worker/nightly-qa-extras/build/meta-poky \ <br>
/home/pokybuild/yocto-autobuilder/yocto-worker/nightly-qa-extras/build/meta-yocto-bsp \ <br>
/home/pokybuild/yocto-autobuilder/yocto-worker/nightly-qa-extras/build/meta-mingw \ <br>
" <br>
<br></code></li>
<li>BuildImages : core-image-sato</li>
<li>DEST : /srv/autobuilder/autobuilder.yoctoproject.org/pub/nightly/20180228-5</li>
<li>DISTRO : poky</li>
<li>Contents of auto.conf (local.conf for autobuilders)<br><code>
INHERIT += "report-error"<br>
DISTRO = "poky"<br>
PACKAGE_CLASSES = "package_rpm package_deb package_ipk"<br>
BB_NUMBER_THREADS = "24"<br>
PARALLEL_MAKE = "-j 28"<br>
SDKMACHINE ?= "i686"<br>
BB_TASK_NICE_LEVEL = "5"<br>
BB_TASK_NICE_LEVEL_task-testimage = "0"<br>
BB_TASK_IONICE_LEVEL = "2.7"<br>
BB_TASK_IONICE_LEVEL_task-testimage = "2.1"<br>
DL_DIR = "/srv/autobuilder/autobuilder.yoctoproject.org/current_sources"<br>
SSTATE_DIR ?= "/srv/autobuilder/autobuilder.yoctoproject.org/pub/sstate/" <br>
MACHINE = "qemux86-64"<br>
PREMIRRORS = ""<br>
BB_GENERATE_MIRROR_TARBALLS = "1"<br>
PRSERV_HOST = "localhost:0"<br>
ADTREPO = "http://adtrepo.yoctoproject.org//2.4+snapshot"<br>
DISTRO_FEATURES_append = " systemd"<br>
VIRTUAL-RUNTIME_init_manager = "systemd"<br>
DISTRO_FEATURES_BACKFILL_CONSIDERED = "sysvinit"<br>
QEMU_USE_KVM = "True"<br>
SDK_EXT_TYPE = "minimal"<br>
SDK_INCLUDE_TOOLCHAIN = "1"<br>
SANITY_TESTED_DISTROS = ""<br>
BB_DISKMON_DIRS = "\ <br>
STOPTASKS,${TMPDIR},1G,100K \ <br>
STOPTASKS,${DL_DIR},1G \ <br>
STOPTASKS,${SSTATE_DIR},1G \ <br>
STOPTASKS,/tmp,100M,100K \ <br>
ABORT,${TMPDIR},100M,1K \ <br>
ABORT,${DL_DIR},100M \ <br>
ABORT,${SSTATE_DIR},100M \ <br>
ABORT,/tmp,10M,1K"<br>
<br></code></li>
<li>MACHINE : qemux86-64</li>
<li>branch : ross/mut</li>
<li>branch_bitbake : master</li>
<li>branch_eclipse-poky-neon : neon-master</li>
<li>branch_eclipse-poky-oxygen : oxygen-master</li>
<li>branch_meta-gplv2 : master</li>
<li>branch_meta-intel : master</li>
<li>branch_meta-mingw : master</li>
<li>branch_meta-qt3 : master</li>
<li>branch_meta-qt4 : master</li>
<li>branch_oecore : master</li>
<li>branch_poky : ross/mut</li>
<li>builddir : /home/pokybuild/yocto-autobuilder/yocto-worker/nightly-qa-extras</li>
<li>buildername : nightly-qa-extras</li>
<li>buildnumber : 813</li>
<li>cloned_layers : meta-mingw</li>
<li>commit_bitbake : 34da85efb4cf76389f97d233571f79b733986ede</li>
<li>commit_eclipse-poky-neon : a5dbc01b96be55c4ec2f774af9996a8086e402ab</li>
<li>commit_eclipse-poky-oxygen : fbb91e5c5ad06470cd50ce1daa407a5f7d13c6ca</li>
<li>commit_meta-gplv2 : 138f6dd943f89604d38a7096def23ea02d55707a</li>
<li>commit_meta-intel : 9a4d583c7de4634a22104ca4c88ddf0d560494b6</li>
<li>commit_meta-mingw : 495a457d697653c0bf5d27809f372056614b8951</li>
<li>commit_meta-qt3 : f33b73a9563f2dfdfd0ee37b61d65d90197a456f</li>
<li>commit_meta-qt4 : f313dbee2ac3d5fcc9801407947d3cb6cfb90b5d</li>
<li>commit_oecore : b30153a15715a83c0f9a7d7d1883a15404992a19</li>
<li>commit_poky : 46f96bec6a63e54faf901d7d6a35f058305a71b6</li>
<li>commit_resolvedhead_bitbake : 34da85efb4cf76389f97d233571f79b733986ede</li>
<li>commit_resolvedhead_eclipse-poky-neon : a5dbc01b96be55c4ec2f774af9996a8086e402ab</li>
<li>commit_resolvedhead_eclipse-poky-oxygen : fbb91e5c5ad06470cd50ce1daa407a5f7d13c6ca</li>
<li>commit_resolvedhead_meta-gplv2 : 138f6dd943f89604d38a7096def23ea02d55707a</li>
<li>commit_resolvedhead_meta-intel : 9a4d583c7de4634a22104ca4c88ddf0d560494b6</li>
<li>commit_resolvedhead_meta-mingw : 495a457d697653c0bf5d27809f372056614b8951</li>
<li>commit_resolvedhead_meta-qt3 : f33b73a9563f2dfdfd0ee37b61d65d90197a456f</li>
<li>commit_resolvedhead_meta-qt4 : f313dbee2ac3d5fcc9801407947d3cb6cfb90b5d</li>
<li>commit_resolvedhead_oecore : b30153a15715a83c0f9a7d7d1883a15404992a19</li>
<li>commit_resolvedhead_poky : 46f96bec6a63e54faf901d7d6a35f058305a71b6</li>
<li>custom_create_eventlog : False</li>
<li>custom_deploy_artifacts : False</li>
<li>custom_yocto_number : None</li>
<li>distroversion : 2.4+snapshot</li>
<li>got_revision : 46f96bec6a63e54faf901d7d6a35f058305a71b6</li>
<li>got_revision_meta-mingw : 495a457d697653c0bf5d27809f372056614b8951</li>
<li>got_revision_poky : 46f96bec6a63e54faf901d7d6a35f058305a71b6</li>
<li>is_release : False</li>
<li>layerversion_core : 11</li>
<li>layerversion_yocto : 3</li>
<li>layerversion_yoctobsp : 4</li>
<li>repo_bitbake : git://git.openembedded.org/bitbake</li>
<li>repo_eclipse-poky-neon : git://git.yoctoproject.org/eclipse-poky</li>
<li>repo_eclipse-poky-oxygen : git://git.yoctoproject.org/eclipse-poky</li>
<li>repo_meta-gplv2 : git://git.yoctoproject.org/meta-gplv2</li>
<li>repo_meta-intel : git://git.yoctoproject.org/meta-intel</li>
<li>repo_meta-mingw : git://git.yoctoproject.org/meta-mingw</li>
<li>repo_meta-qt3 : git://git.yoctoproject.org/meta-qt3</li>
<li>repo_meta-qt4 : git://git.yoctoproject.org/meta-qt4</li>
<li>repo_oecore : git://git.openembedded.org/openembedded-core</li>
<li>repo_poky : git://git.yoctoproject.org/poky-contrib</li>
<li>repository : git://git.yoctoproject.org/poky-contrib</li>
<li>repourl_meta-mingw : git://git.yoctoproject.org/meta-mingw</li>
<li>repourl_poky : git://git.yoctoproject.org/poky-contrib</li>
<li>revision : 46f96bec6a63e54faf901d7d6a35f058305a71b6</li>
<li>scheduler : trigger_main-build_nowait</li>
<li>slavename : opensuse423.yocto.io</li>
<li>workdir : /home/pokybuild/yocto-autobuilder/yocto-worker/nightly-qa-extras</li>
</ul>
<i>Detailed log of last build step:</i> <a href="https://autobuilder.yocto.io/builders/nightly-qa-extras/builds/813/steps/BuildImages_2/logs/stdio">https://autobuilder.yocto.io/builders/nightly-qa-extras/builds/813/steps/BuildImages_2/logs/stdio</a>
<br>
<h4>Last 60 lines of "BuildImages_2.stdio" Error log:</h4>
<p>
| make[4]: Leaving directory '/home/pokybuild/yocto-autobuilder/yocto-worker/nightly-qa-extras/build/build/tmp/work/core2-64-poky-linux/harfbuzz/1.7.5-r0/build/test/shaping/data'<br>| make[4]: Entering directory '/home/pokybuild/yocto-autobuilder/yocto-worker/nightly-qa-extras/build/build/tmp/work/core2-64-poky-linux/harfbuzz/1.7.5-r0/build/test/shaping'<br>| make[4]: Nothing to be done for 'all-am'.<br>| make[4]: Leaving directory '/home/pokybuild/yocto-autobuilder/yocto-worker/nightly-qa-extras/build/build/tmp/work/core2-64-poky-linux/harfbuzz/1.7.5-r0/build/test/shaping'<br>| make[3]: Leaving directory '/home/pokybuild/yocto-autobuilder/yocto-worker/nightly-qa-extras/build/build/tmp/work/core2-64-poky-linux/harfbuzz/1.7.5-r0/build/test/shaping'<br>| Making all in fuzzing<br>| make[3]: Entering directory '/home/pokybuild/yocto-autobuilder/yocto-worker/nightly-qa-extras/build/build/tmp/work/core2-64-poky-linux/harfbuzz/1.7.5-r0/build/test/fuzzing'<br>| make[3]: Nothing to be done fo
 r 'all'.<br>| make[3]: Leaving directory '/home/pokybuild/yocto-autobuilder/yocto-worker/nightly-qa-extras/build/build/tmp/work/core2-64-poky-linux/harfbuzz/1.7.5-r0/build/test/fuzzing'<br>| make[3]: Entering directory '/home/pokybuild/yocto-autobuilder/yocto-worker/nightly-qa-extras/build/build/tmp/work/core2-64-poky-linux/harfbuzz/1.7.5-r0/build/test'<br>| make[3]: Nothing to be done for 'all-am'.<br>| make[3]: Leaving directory '/home/pokybuild/yocto-autobuilder/yocto-worker/nightly-qa-extras/build/build/tmp/work/core2-64-poky-linux/harfbuzz/1.7.5-r0/build/test'<br>| make[2]: Leaving directory '/home/pokybuild/yocto-autobuilder/yocto-worker/nightly-qa-extras/build/build/tmp/work/core2-64-poky-linux/harfbuzz/1.7.5-r0/build/test'<br>| Making all in docs<br>| make[2]: Entering directory '/home/pokybuild/yocto-autobuilder/yocto-worker/nightly-qa-extras/build/build/tmp/work/core2-64-poky-linux/harfbuzz/1.7.5-r0/build/docs'<br>| if test "/home/pokybuild/yocto-autobuilder/yocto-worker/n
 ightly-qa-extras/build/build/tmp/work/core2-64-poky-linux/harfbuzz/1.7.5-r0/build/../harfbuzz-1.7.5/docs" != "/home/pokybuild/yocto-autobuilder/yocto-worker/nightly-qa-extras/build/build/tmp/work/core2-64-poky-linux/harfbuzz/1.7.5-r0/build/docs" ; then \<br>|   files=`echo usermanual-buffers-language-script-and-direction.xml usermanual-clusters.xml usermanual-fonts-and-faces.xml usermanual-glyph-information.xml usermanual-hello-harfbuzz.xml usermanual-install-harfbuzz.xml usermanual-opentype-features.xml usermanual-what-is-harfbuzz.xml version.xml  harfbuzz-docs.xml harfbuzz-sections.txt harfbuzz-overrides.txt harfbuzz.types`; \<br>|   if test "x$files" != "x" ; then \<br>|     for file in $files ; do \<br>|       destdir=`dirname /home/pokybuild/yocto-autobuilder/yocto-worker/nightly-qa-extras/build/build/tmp/work/core2-64-poky-linux/harfbuzz/1.7.5-r0/build/docs/$file`; \<br>|       test -d "$destdir" || mkdir -p "$destdir"; \<br>|       test -f /home/pokybuild/yocto-autobuilder/yo
 cto-worker/nightly-qa-extras/build/build/tmp/work/core2-64-poky-linux/harfbuzz/1.7.5-r0/build/../harfbuzz-1.7.5/docs/$file && \<br>|         cp -pf /home/pokybuild/yocto-autobuilder/yocto-worker/nightly-qa-extras/build/build/tmp/work/core2-64-poky-linux/harfbuzz/1.7.5-r0/build/../harfbuzz-1.7.5/docs/$file /home/pokybuild/yocto-autobuilder/yocto-worker/nightly-qa-extras/build/build/tmp/work/core2-64-poky-linux/harfbuzz/1.7.5-r0/build/docs/$file || true; \<br>|     done; \<br>|   fi; \<br>| fi<br>| /home/pokybuild/yocto-autobuilder/yocto-worker/nightly-qa-extras/build/build/tmp/hosttools/mkdir -p xml && ( \<br>|  echo "<!ENTITY package \"harfbuzz\">"; \<br>|   echo "<!ENTITY package_bugreport \"https://github.com/harfbuzz/harfbuzz/issues/new\">"; \<br>|  echo "<!ENTITY package_name \"HarfBuzz\">"; \<br>|      echo "<!ENTITY package_string \"HarfBuzz 1.7.5\">"; \<br>|      echo "<!ENTITY package_tarname \"harfbuzz\">"; \<br>|   echo "<!ENTITY package_url \"http://harfbuzz.org/\">"; \<br>|   echo 
 "<!ENTITY package_version \"1.7.5\">"; \<br>| ) > xml/gtkdocentities.ent<br>| touch setup-build.stamp<br>| _source_dir='' ; \<br>| for i in ../../harfbuzz-1.7.5/src ../src ; do \<br>|   _source_dir="${_source_dir} --source-dir=$i" ; \<br>| done ; \<br>| gtkdoc-scan --module=harfbuzz --ignore-headers="`cd ../../harfbuzz-1.7.5/src; find . -path './hb-*/*.h' | sed 's@^.*/@@'` hb-gobject.h hb-gobject-enums.h hb-gobject-structs.h" ${_source_dir} --rebuild-types --deprecated-guards="HB_DISABLE_DEPRECATED" --ignore-decorators="HB_EXTERN" ../src/hb-version.h<br>| Traceback (most recent call last):<br>|   File "/home/pokybuild/yocto-autobuilder/yocto-worker/nightly-qa-extras/build/build/tmp/work/core2-64-poky-linux/harfbuzz/1.7.5-r0/recipe-sysroot-native/usr/bin/gtkdoc-scan", line 29, in <module><br>|     from gtkdoc import common, config, scan<br>|   File "/home/pokybuild/yocto-autobuilder/yocto-worker/nightly-qa-extras/build/build/tmp/work/core2-64-poky-linux/harfbuzz/1.7.5-r0/recipe-sysro
 ot-native/usr/share/gtk-doc/python/gtkdoc/common.py", line 31, in <module><br>|     import six<br>| ImportError: No module named 'six'<br>| Makefile:736: recipe for target 'scan-build.stamp' failed<br>| make[2]: *** [scan-build.stamp] Error 1<br>| make[2]: Leaving directory '/home/pokybuild/yocto-autobuilder/yocto-worker/nightly-qa-extras/build/build/tmp/work/core2-64-poky-linux/harfbuzz/1.7.5-r0/build/docs'<br>| Makefile:489: recipe for target 'all-recursive' failed<br>| make[1]: *** [all-recursive] Error 1<br>| make[1]: Leaving directory '/home/pokybuild/yocto-autobuilder/yocto-worker/nightly-qa-extras/build/build/tmp/work/core2-64-poky-linux/harfbuzz/1.7.5-r0/build'<br>| Makefile:421: recipe for target 'all' failed<br>| make: *** [all] Error 2<br>| ERROR: oe_runmake failed<br>| WARNING: /home/pokybuild/yocto-autobuilder/yocto-worker/nightly-qa-extras/build/build/tmp/work/core2-64-poky-linux/harfbuzz/1.7.5-r0/temp/run.do_compile.52118:1 exit 1 from 'exit 1'<br>| ERROR: Function fa
 iled: do_compile (log file is located at /home/pokybuild/yocto-autobuilder/yocto-worker/nightly-qa-extras/build/build/tmp/work/core2-64-poky-linux/harfbuzz/1.7.5-r0/temp/log.do_compile.52118)<br>ERROR: Task (/home/pokybuild/yocto-autobuilder/yocto-worker/nightly-qa-extras/build/meta/recipes-graphics/harfbuzz/harfbuzz_1.7.5.bb:do_compile) failed with exit code '1'<br>Summary: There were 12 ERROR messages shown, returning a non-zero exit code.
</p>
<i>Detailed log of last build step:</i> <a href="https://autobuilder.yocto.io/builders/nightly-qa-extras/builds/813/steps/Running Sanity Tests_2/logs/stdio">https://autobuilder.yocto.io/builders/nightly-qa-extras/builds/813/steps/Running Sanity Tests_2/logs/stdio</a>
<br>
<h4>Last 60 lines of "Running Sanity Tests_2.stdio" Error log:</h4>
<p>
| DEBUG: Stopping logging thread<br>| DEBUG: Stop event received<br>| DEBUG: Tearing down logging thread<br>| DEBUG: Sending SIGTERM to runqemu<br>| RESULTS:<br>| RESULTS - connman.ConnmanTest.test_connmand_help - Testcase 961: PASSED<br>| RESULTS - connman.ConnmanTest.test_connmand_running - Testcase 221: PASSED<br>| RESULTS - date.DateTest.test_date - Testcase 211: PASSED<br>| RESULTS - df.DfTest.test_df - Testcase 234: PASSED<br>| RESULTS - dnf.DnfBasicTest.test_dnf_help - Testcase 1735: PASSED<br>| RESULTS - dnf.DnfBasicTest.test_dnf_history - Testcase 1736: PASSED<br>| RESULTS - dnf.DnfBasicTest.test_dnf_info - Testcase 1737: PASSED<br>| RESULTS - dnf.DnfBasicTest.test_dnf_search - Testcase 1738: PASSED<br>| RESULTS - dnf.DnfBasicTest.test_dnf_version - Testcase 1739: PASSED<br>| RESULTS - dnf.DnfRepoTest.test_dnf_install - Testcase 1740: PASSED<br>| RESULTS - dnf.DnfRepoTest.test_dnf_install_dependency - Testcase 1741: PASSED<br>| RESULTS - dnf.DnfRepoTest.test_dnf_install_from
 _disk - Testcase 1742: PASSED<br>| RESULTS - dnf.DnfRepoTest.test_dnf_install_from_http - Testcase 1743: PASSED<br>| RESULTS - dnf.DnfRepoTest.test_dnf_makecache - Testcase 1744: PASSED<br>| RESULTS - dnf.DnfRepoTest.test_dnf_reinstall - Testcase 1745: PASSED<br>| RESULTS - dnf.DnfRepoTest.test_dnf_repoinfo - Testcase 1746: PASSED<br>| RESULTS - gi.GObjectIntrospectionTest.test_python - Testcase -1: SKIPPED<br>| RESULTS - logrotate.LogrotateTest.test_1_logrotate_setup - Testcase 1544: PASSED<br>| RESULTS - logrotate.LogrotateTest.test_2_logrotate - Testcase 1542: PASSED<br>| RESULTS - oe_syslog.SyslogTest.test_syslog_running - Testcase 201: PASSED<br>| RESULTS - oe_syslog.SyslogTestConfig.test_syslog_logger - Testcase 1149: PASSED<br>| RESULTS - oe_syslog.SyslogTestConfig.test_syslog_restart - Testcase 1150: PASSED<br>| RESULTS - oe_syslog.SyslogTestConfig.test_syslog_startup_config - Testcase 202: PASSED<br>| RESULTS - parselogs.ParseLogsTest.test_parselogs - Testcase 1059: PASSED<
 br>| RESULTS - ping.PingTest.test_ping - Testcase 964: PASSED<br>| RESULTS - ptest.PtestRunnerTest.test_ptestrunner - Testcase 1600: FAILED<br>| RESULTS - python.PythonTest.test_python_exists - Testcase 1145: SKIPPED<br>| RESULTS - python.PythonTest.test_python_stdout - Testcase 965: SKIPPED<br>| RESULTS - python.PythonTest.test_python_testfile - Testcase 1146: SKIPPED<br>| RESULTS - rpm.RpmBasicTest.test_rpm_help - Testcase 960: PASSED<br>| RESULTS - rpm.RpmBasicTest.test_rpm_query - Testcase 191: PASSED<br>| RESULTS - rpm.RpmInstallRemoveTest.test_check_rpm_install_removal_log_file_size - Testcase 195: PASSED<br>| RESULTS - rpm.RpmInstallRemoveTest.test_rpm_install - Testcase 192: PASSED<br>| RESULTS - rpm.RpmInstallRemoveTest.test_rpm_query_nonroot - Testcase 1096: PASSED<br>| RESULTS - rpm.RpmInstallRemoveTest.test_rpm_remove - Testcase 194: PASSED<br>| RESULTS - scp.ScpTest.test_scp_file - Testcase 220: PASSED<br>| RESULTS - ssh.SSHTest.test_ssh - Testcase 224: PASSED<br>| RESU
 LTS - xorg.XorgTest.test_xorg_running - Testcase 1151: PASSED<br>| SUMMARY:<br>| core-image-sato () - Ran 38 tests in 37.820s<br>| core-image-sato - FAIL - Required tests failed (skipped=4)<br>| ERROR: core-image-sato - FAILED - check the task log and the ssh log<br>| DEBUG: Python function do_testimage finished<br>| ERROR: Function failed: do_testimage<br>| Machine information:<br>| *******************************<br>| Machine name: qemux86-64<br>| CPU:  Intel(R) Core(TM)2 Duo CPU     T7700  @ 2.40GHz<br>| Arch: x86_64<br>| Physical cores: 1<br>| Logical cores: 1<br>| *******************************<br>| <br>ERROR: Task (/home/pokybuild/yocto-autobuilder/yocto-worker/nightly-qa-extras/build/meta/recipes-sato/images/core-image-sato.bb:do_testimage) failed with exit code '1'<br>Summary: There were 2 ERROR messages shown, returning a non-zero exit code.
</p>
<i>Detailed log of last build step:</i> <a href="https://autobuilder.yocto.io/builders/nightly-qa-extras/builds/813/steps/Running Sanity Tests_3/logs/stdio">https://autobuilder.yocto.io/builders/nightly-qa-extras/builds/813/steps/Running Sanity Tests_3/logs/stdio</a>
<br>
<h4>Last 60 lines of "Running Sanity Tests_3.stdio" Error log:</h4>
<p>
| NOTE:  (failures=1, skipped=4)<br>| DEBUG: Stopping logging thread<br>| DEBUG: Stop event received<br>| DEBUG: Tearing down logging thread<br>| DEBUG: Sending SIGTERM to runqemu<br>| RESULTS:<br>| RESULTS - connman.ConnmanTest.test_connmand_help - Testcase 961: PASSED<br>| RESULTS - connman.ConnmanTest.test_connmand_running - Testcase 221: PASSED<br>| RESULTS - date.DateTest.test_date - Testcase 211: PASSED<br>| RESULTS - df.DfTest.test_df - Testcase 234: PASSED<br>| RESULTS - dnf.DnfBasicTest.test_dnf_help - Testcase 1735: PASSED<br>| RESULTS - dnf.DnfBasicTest.test_dnf_history - Testcase 1736: PASSED<br>| RESULTS - dnf.DnfBasicTest.test_dnf_info - Testcase 1737: PASSED<br>| RESULTS - dnf.DnfBasicTest.test_dnf_search - Testcase 1738: PASSED<br>| RESULTS - dnf.DnfBasicTest.test_dnf_version - Testcase 1739: PASSED<br>| RESULTS - dnf.DnfRepoTest.test_dnf_install - Testcase 1740: PASSED<br>| RESULTS - dnf.DnfRepoTest.test_dnf_install_dependency - Testcase 1741: PASSED<br>| RESULTS - d
 nf.DnfRepoTest.test_dnf_install_from_disk - Testcase 1742: PASSED<br>| RESULTS - dnf.DnfRepoTest.test_dnf_install_from_http - Testcase 1743: PASSED<br>| RESULTS - dnf.DnfRepoTest.test_dnf_makecache - Testcase 1744: PASSED<br>| RESULTS - dnf.DnfRepoTest.test_dnf_reinstall - Testcase 1745: PASSED<br>| RESULTS - dnf.DnfRepoTest.test_dnf_repoinfo - Testcase 1746: PASSED<br>| RESULTS - gi.GObjectIntrospectionTest.test_python - Testcase -1: SKIPPED<br>| RESULTS - oe_syslog.SyslogTest.test_syslog_running - Testcase 201: PASSED<br>| RESULTS - oe_syslog.SyslogTestConfig.test_syslog_logger - Testcase 1149: PASSED<br>| RESULTS - oe_syslog.SyslogTestConfig.test_syslog_restart - Testcase 1150: PASSED<br>| RESULTS - oe_syslog.SyslogTestConfig.test_syslog_startup_config - Testcase 202: PASSED<br>| RESULTS - pam.PamBasicTest.test_pam - Testcase 1543: PASSED<br>| RESULTS - parselogs.ParseLogsTest.test_parselogs - Testcase 1059: PASSED<br>| RESULTS - ping.PingTest.test_ping - Testcase 964: PASSED<br>
 | RESULTS - ptest.PtestRunnerTest.test_ptestrunner - Testcase 1600: FAILED<br>| RESULTS - python.PythonTest.test_python_exists - Testcase 1145: SKIPPED<br>| RESULTS - python.PythonTest.test_python_stdout - Testcase 965: SKIPPED<br>| RESULTS - python.PythonTest.test_python_testfile - Testcase 1146: SKIPPED<br>| RESULTS - rpm.RpmBasicTest.test_rpm_help - Testcase 960: PASSED<br>| RESULTS - rpm.RpmBasicTest.test_rpm_query - Testcase 191: PASSED<br>| RESULTS - rpm.RpmInstallRemoveTest.test_check_rpm_install_removal_log_file_size - Testcase 195: PASSED<br>| RESULTS - rpm.RpmInstallRemoveTest.test_rpm_install - Testcase 192: PASSED<br>| RESULTS - rpm.RpmInstallRemoveTest.test_rpm_query_nonroot - Testcase 1096: PASSED<br>| RESULTS - rpm.RpmInstallRemoveTest.test_rpm_remove - Testcase 194: PASSED<br>| RESULTS - scp.ScpTest.test_scp_file - Testcase 220: PASSED<br>| RESULTS - ssh.SSHTest.test_ssh - Testcase 224: PASSED<br>| RESULTS - xorg.XorgTest.test_xorg_running - Testcase 1151: PASSED<br>
 | SUMMARY:<br>| core-image-sato () - Ran 37 tests in 36.799s<br>| core-image-sato - FAIL - Required tests failed (skipped=4)<br>| ERROR: core-image-sato - FAILED - check the task log and the ssh log<br>| DEBUG: Python function do_testimage finished<br>| ERROR: Function failed: do_testimage<br>| Machine information:<br>| *******************************<br>| Machine name: qemux86-64<br>| CPU:  Intel(R) Core(TM)2 Duo CPU     T7700  @ 2.40GHz<br>| Arch: x86_64<br>| Physical cores: 1<br>| Logical cores: 1<br>| *******************************<br>| <br>ERROR: Task (/home/pokybuild/yocto-autobuilder/yocto-worker/nightly-qa-extras/build/meta/recipes-sato/images/core-image-sato.bb:do_testimage) failed with exit code '1'<br>Summary: There were 2 ERROR messages shown, returning a non-zero exit code.
</p>
<i>Detailed log of last build step:</i> <a href="https://autobuilder.yocto.io/builders/nightly-qa-extras/builds/813/steps/Running Sanity Tests_4/logs/stdio">https://autobuilder.yocto.io/builders/nightly-qa-extras/builds/813/steps/Running Sanity Tests_4/logs/stdio</a>
<br>
<h4>Last 60 lines of "Running Sanity Tests_4.stdio" Error log:</h4>
<p>
| DEBUG: Stopping logging thread<br>| DEBUG: Stop event received<br>| DEBUG: Tearing down logging thread<br>| DEBUG: Sending SIGTERM to runqemu<br>| RESULTS:<br>| RESULTS - connman.ConnmanTest.test_connmand_help - Testcase 961: PASSED<br>| RESULTS - connman.ConnmanTest.test_connmand_running - Testcase 221: PASSED<br>| RESULTS - date.DateTest.test_date - Testcase 211: PASSED<br>| RESULTS - df.DfTest.test_df - Testcase 234: PASSED<br>| RESULTS - dnf.DnfBasicTest.test_dnf_help - Testcase 1735: PASSED<br>| RESULTS - dnf.DnfBasicTest.test_dnf_history - Testcase 1736: PASSED<br>| RESULTS - dnf.DnfBasicTest.test_dnf_info - Testcase 1737: PASSED<br>| RESULTS - dnf.DnfBasicTest.test_dnf_search - Testcase 1738: PASSED<br>| RESULTS - dnf.DnfBasicTest.test_dnf_version - Testcase 1739: PASSED<br>| RESULTS - dnf.DnfRepoTest.test_dnf_install - Testcase 1740: PASSED<br>| RESULTS - dnf.DnfRepoTest.test_dnf_install_dependency - Testcase 1741: PASSED<br>| RESULTS - dnf.DnfRepoTest.test_dnf_install_from
 _disk - Testcase 1742: PASSED<br>| RESULTS - dnf.DnfRepoTest.test_dnf_install_from_http - Testcase 1743: PASSED<br>| RESULTS - dnf.DnfRepoTest.test_dnf_makecache - Testcase 1744: PASSED<br>| RESULTS - dnf.DnfRepoTest.test_dnf_reinstall - Testcase 1745: PASSED<br>| RESULTS - dnf.DnfRepoTest.test_dnf_repoinfo - Testcase 1746: PASSED<br>| RESULTS - gi.GObjectIntrospectionTest.test_python - Testcase -1: SKIPPED<br>| RESULTS - oe_syslog.SyslogTest.test_syslog_running - Testcase 201: PASSED<br>| RESULTS - oe_syslog.SyslogTestConfig.test_syslog_logger - Testcase 1149: PASSED<br>| RESULTS - oe_syslog.SyslogTestConfig.test_syslog_restart - Testcase 1150: PASSED<br>| RESULTS - oe_syslog.SyslogTestConfig.test_syslog_startup_config - Testcase 202: PASSED<br>| RESULTS - parselogs.ParseLogsTest.test_parselogs - Testcase 1059: PASSED<br>| RESULTS - ping.PingTest.test_ping - Testcase 964: PASSED<br>| RESULTS - ptest.PtestRunnerTest.test_ptestrunner - Testcase 1600: FAILED<br>| RESULTS - python.Pyth
 onTest.test_python_exists - Testcase 1145: SKIPPED<br>| RESULTS - python.PythonTest.test_python_stdout - Testcase 965: SKIPPED<br>| RESULTS - python.PythonTest.test_python_testfile - Testcase 1146: SKIPPED<br>| RESULTS - rpm.RpmBasicTest.test_rpm_help - Testcase 960: PASSED<br>| RESULTS - rpm.RpmBasicTest.test_rpm_query - Testcase 191: PASSED<br>| RESULTS - rpm.RpmInstallRemoveTest.test_check_rpm_install_removal_log_file_size - Testcase 195: PASSED<br>| RESULTS - rpm.RpmInstallRemoveTest.test_rpm_install - Testcase 192: PASSED<br>| RESULTS - rpm.RpmInstallRemoveTest.test_rpm_query_nonroot - Testcase 1096: PASSED<br>| RESULTS - rpm.RpmInstallRemoveTest.test_rpm_remove - Testcase 194: PASSED<br>| RESULTS - scp.ScpTest.test_scp_file - Testcase 220: PASSED<br>| RESULTS - skeletoninit.SkeletonBasicTest.test_skeleton_availability - Testcase -1: PASSED<br>| RESULTS - skeletoninit.SkeletonBasicTest.test_skeleton_script - Testcase 284: PASSED<br>| RESULTS - ssh.SSHTest.test_ssh - Testcase 22
 4: PASSED<br>| RESULTS - xorg.XorgTest.test_xorg_running - Testcase 1151: PASSED<br>| SUMMARY:<br>| core-image-sato () - Ran 38 tests in 37.425s<br>| core-image-sato - FAIL - Required tests failed (skipped=4)<br>| ERROR: core-image-sato - FAILED - check the task log and the ssh log<br>| DEBUG: Python function do_testimage finished<br>| ERROR: Function failed: do_testimage<br>| Machine information:<br>| *******************************<br>| Machine name: qemux86-64<br>| CPU:  Intel(R) Core(TM)2 Duo CPU     T7700  @ 2.40GHz<br>| Arch: x86_64<br>| Physical cores: 1<br>| Logical cores: 1<br>| *******************************<br>| <br>ERROR: Task (/home/pokybuild/yocto-autobuilder/yocto-worker/nightly-qa-extras/build/meta/recipes-sato/images/core-image-sato.bb:do_testimage) failed with exit code '1'<br>Summary: There were 2 ERROR messages shown, returning a non-zero exit code.
</p>
<i>Detailed log of last build step:</i> <a href="https://autobuilder.yocto.io/builders/nightly-qa-extras/builds/813/steps/Running Sanity Tests_5/logs/stdio">https://autobuilder.yocto.io/builders/nightly-qa-extras/builds/813/steps/Running Sanity Tests_5/logs/stdio</a>
<br>
<h4>Last 60 lines of "Running Sanity Tests_5.stdio" Error log:</h4>
<p>
| DEBUG: qemu cmdline used:<br>| /home/pokybuild/yocto-autobuilder/yocto-worker/nightly-qa-extras/build/build/tmp/work/x86_64-linux/qemu-helper-native/1.0-r1/recipe-sysroot-native/usr/bin/qemu-system-x86_64 -device virtio-net-pci,netdev=net0,mac=52:54:00:12:34:06 -netdev tap,id=net0,ifname=tap2,script=no,downscript=no -drive file=/home/pokybuild/yocto-autobuilder/yocto-worker/nightly-qa-extras/build/build/tmp/deploy/images/qemux86-64/core-image-sato-qemux86-64.ext4,if=virtio,format=raw -vga vmware -show-cursor -usb -device usb-tablet -device virtio-rng-pci -serial tcp:127.0.0.1:48622 -pidfile pidfile_31764 -cpu core2duo -enable-kvm -m 256 -serial tcp:127.0.0.1:53135 -snapshot -kernel /home/pokybuild/yocto-autobuilder/yocto-worker/nightly-qa-extras/build/build/tmp/deploy/images/qemux86-64/bzImage--4.14.19+git0+c5e05f3c61_57ed1d816d-r0.2-qemux86-64-20180228133844.bin -append root=/dev/vda rw highres=off  mem=256M ip=192.168.7.6::192.168.7.5:255.255.255.0 vga=0 uvesafb.mode_option=640x4
 80-32 oprofile.timer=1 uvesafb.task_timeout=-1 console=tty1 console=ttyS0,115200n8 printk.time=1 systemd.log_target=console<br>| DEBUG: Target IP: 192.168.7.6<br>| DEBUG: Server IP: 192.168.7.5<br>| DEBUG: Starting logging thread<br>| DEBUG: Starting thread event loop<br>| DEBUG: Connection request received<br>| DEBUG: Setting connection established event<br>| DEBUG: Output from runqemu:<br>| runqemu - INFO - Continuing with the following parameters:<br>| <br>| runqemu - INFO - Acquiring lockfile /tmp/qemu-tap-locks/tap0.lock failed: [Errno 11] Resource temporarily unavailable<br>| runqemu - INFO - Acquiring lockfile /tmp/qemu-tap-locks/tap1.lock failed: [Errno 11] Resource temporarily unavailable<br>| runqemu - INFO - Using preconfigured tap device tap2<br>| runqemu - INFO - If this is not intended, touch /tmp/qemu-tap-locks/tap2.skip to make runqemu skip tap2.<br>| runqemu - INFO - Network configuration: 192.168.7.6::192.168.7.5:255.255.255.0<br>| runqemu - INFO - Running /home/po
 kybuild/yocto-autobuilder/yocto-worker/nightly-qa-extras/build/build/tmp/work/x86_64-linux/qemu-helper-native/1.0-r1/recipe-sysroot-native/usr/bin/qemu-system-x86_64 -device virtio-net-pci,netdev=net0,mac=52:54:00:12:34:06 -netdev tap,id=net0,ifname=tap2,script=no,downscript=no -drive file=/home/pokybuild/yocto-autobuilder/yocto-worker/nightly-qa-extras/build/build/tmp/deploy/images/qemux86-64/core-image-sato-qemux86-64.ext4,if=virtio,format=raw -vga vmware -show-cursor -usb -device usb-tablet -device virtio-rng-pci  -serial tcp:127.0.0.1:48622 -pidfile pidfile_31764  -cpu core2duo -enable-kvm -m 256 -serial tcp:127.0.0.1:53135 -snapshot -kernel /home/pokybuild/yocto-autobuilder/yocto-worker/nightly-qa-extras/build/build/tmp/deploy/images/qemux86-64/bzImage--4.14.19+git0+c5e05f3c61_57ed1d816d-r0.2-qemux86-64-20180228133844.bin -append 'root=/dev/vda rw highres=off  mem=256M ip=192.168.7.6::192.168.7.5:255.255.255.0 vga=0 uvesafb.mode_option=640x480-32 oprofile.timer=1 uvesafb.task_t
 imeout=-1 console=tty1 console=ttyS0,115200n8 printk.time=1 systemd.log_target=console'<br>| <br>| <br>| DEBUG: Waiting at most 1500 seconds for login banner (02/28/18 17:42:07)<br>| DEBUG: Connection from 127.0.0.1:40528<br>| DEBUG: Target didn't reach login banner in 1500 seconds (02/28/18 18:07:08)<br>| DEBUG: Last 25 lines of text:<br>| Looping too fast. Throttling execution a little.<br>| Looping too fast. Throttling execution a little.<br>| Looping too fast. Throttling execution a little.<br>| Looping too fast. Throttling execution a little.<br>| Looping too fast. Throttling execution a little.<br>| Looping too fast. Throttling execution a little.<br>| Looping too fast. Throttling execution a little.<br>| Looping too fast. Throttling execution a little.<br>| Looping too fast. Throttling execution a little.<br>| Looping too fast. Throttling execution a little.<br>| Looping too fast. Throttling execution a little.<br>| Looping too fast. Throttling execution a little.<br>| Loopin
 g too fast. Throttling execution a little.<br>| Looping too fast. Throttling execution a little.<br>| Looping too fast. Throttling execution a little.<br>| Looping too fast. Throttling execution a little.<br>| Looping too fast. Throttling execution a little.<br>| Looping too fast. Throttling execution a little.<br>| Looping too fast. Throttling execution a little.<br>| Looping too fast. Throttling execution a little.<br>| Looping too fast. Throttling execution a little.<br>| Looping too fast. Throttling execution a little.<br>| Looping too fast. Throttling execution a little.<br>| Looping too fast. Throttling execution a little.<br>| Looping too fast. Throttling execution a little.<br>| DEBUG: Check full boot log: /home/pokybuild/yocto-autobuilder/yocto-worker/nightly-qa-extras/build/build/tmp/work/qemux86_64-poky-linux/core-image-sato/1.0-r0/testimage/qemu_boot_log.20180228174202<br>| WARNING: Qemu ended unexpectedly, dump data from host is in /tmp/oe-saved-tests/201802281807_qemu<
 br>| DEBUG: Stopping logging thread<br>| DEBUG: Stop event received<br>| DEBUG: Tearing down logging thread<br>| DEBUG: Sending SIGTERM to runqemu<br>| ERROR: testimage received SIGTERM, shutting down...<br>| ERROR: core-image-sato - FAILED - tests were interrupted during execution<br>| DEBUG: Python function do_testimage finished<br>| ERROR: Function failed: do_testimage<br>ERROR: Task (/home/pokybuild/yocto-autobuilder/yocto-worker/nightly-qa-extras/build/meta/recipes-sato/images/core-image-sato.bb:do_testimage) failed with exit code '1'<br>Summary: There were 3 ERROR messages shown, returning a non-zero exit code.
</p>
<i>Detailed log of last build step:</i> <a href="https://autobuilder.yocto.io/builders/nightly-qa-extras/builds/813/steps/Running Sanity Tests_6/logs/stdio">https://autobuilder.yocto.io/builders/nightly-qa-extras/builds/813/steps/Running Sanity Tests_6/logs/stdio</a>
<br>
<h4>Last 60 lines of "Running Sanity Tests_6.stdio" Error log:</h4>
<p>
| RESULTS - connman.ConnmanTest.test_connmand_running - Testcase 221: SKIPPED<br>| RESULTS - date.DateTest.test_date - Testcase 211: PASSED<br>| RESULTS - df.DfTest.test_df - Testcase 234: PASSED<br>| RESULTS - dnf.DnfBasicTest.test_dnf_help - Testcase 1735: PASSED<br>| RESULTS - dnf.DnfBasicTest.test_dnf_history - Testcase 1736: PASSED<br>| RESULTS - dnf.DnfBasicTest.test_dnf_info - Testcase 1737: PASSED<br>| RESULTS - dnf.DnfBasicTest.test_dnf_search - Testcase 1738: PASSED<br>| RESULTS - dnf.DnfBasicTest.test_dnf_version - Testcase 1739: PASSED<br>| RESULTS - dnf.DnfRepoTest.test_dnf_install - Testcase 1740: FAILED<br>| RESULTS - dnf.DnfRepoTest.test_dnf_install_dependency - Testcase 1741: SKIPPED<br>| RESULTS - dnf.DnfRepoTest.test_dnf_install_from_disk - Testcase 1742: SKIPPED<br>| RESULTS - dnf.DnfRepoTest.test_dnf_install_from_http - Testcase 1743: SKIPPED<br>| RESULTS - dnf.DnfRepoTest.test_dnf_makecache - Testcase 1744: PASSED<br>| RESULTS - dnf.DnfRepoTest.test_dnf_reinstal
 l - Testcase 1745: SKIPPED<br>| RESULTS - dnf.DnfRepoTest.test_dnf_repoinfo - Testcase 1746: PASSED<br>| RESULTS - gi.GObjectIntrospectionTest.test_python - Testcase -1: SKIPPED<br>| RESULTS - oe_syslog.SyslogTest.test_syslog_running - Testcase 201: PASSED<br>| RESULTS - oe_syslog.SyslogTestConfig.test_syslog_logger - Testcase 1149: PASSED<br>| RESULTS - oe_syslog.SyslogTestConfig.test_syslog_restart - Testcase 1150: PASSED<br>| RESULTS - oe_syslog.SyslogTestConfig.test_syslog_startup_config - Testcase 202: PASSED<br>| RESULTS - parselogs.ParseLogsTest.test_parselogs - Testcase 1059: PASSED<br>| RESULTS - ping.PingTest.test_ping - Testcase 964: PASSED<br>| RESULTS - ptest.PtestRunnerTest.test_ptestrunner - Testcase 1600: FAILED<br>| RESULTS - python.PythonTest.test_python_exists - Testcase 1145: SKIPPED<br>| RESULTS - python.PythonTest.test_python_stdout - Testcase 965: SKIPPED<br>| RESULTS - python.PythonTest.test_python_testfile - Testcase 1146: SKIPPED<br>| RESULTS - rpm.RpmBasic
 Test.test_rpm_help - Testcase 960: PASSED<br>| RESULTS - rpm.RpmBasicTest.test_rpm_query - Testcase 191: PASSED<br>| RESULTS - rpm.RpmInstallRemoveTest.test_check_rpm_install_removal_log_file_size - Testcase 195: SKIPPED<br>| RESULTS - rpm.RpmInstallRemoveTest.test_rpm_install - Testcase 192: FAILED<br>| RESULTS - rpm.RpmInstallRemoveTest.test_rpm_query_nonroot - Testcase 1096: PASSED<br>| RESULTS - rpm.RpmInstallRemoveTest.test_rpm_remove - Testcase 194: SKIPPED<br>| RESULTS - scp.ScpTest.test_scp_file - Testcase 220: PASSED<br>| RESULTS - ssh.SSHTest.test_ssh - Testcase 224: PASSED<br>| RESULTS - systemd.SystemdBasicTests.test_systemd_basic - Testcase -1: SKIPPED<br>| RESULTS - systemd.SystemdBasicTests.test_systemd_failed - Testcase 550: SKIPPED<br>| RESULTS - systemd.SystemdBasicTests.test_systemd_list - Testcase 551: SKIPPED<br>| RESULTS - systemd.SystemdJournalTests.test_systemd_boot_time - Testcase -1: SKIPPED<br>| RESULTS - systemd.SystemdJournalTests.test_systemd_journal - 
 Testcase -1: SKIPPED<br>| RESULTS - systemd.SystemdServiceTests.test_systemd_disable_enable - Testcase 696: SKIPPED<br>| RESULTS - systemd.SystemdServiceTests.test_systemd_status - Testcase -1: SKIPPED<br>| RESULTS - systemd.SystemdServiceTests.test_systemd_stop_start - Testcase 695: SKIPPED<br>| RESULTS - xorg.XorgTest.test_xorg_running - Testcase 1151: PASSED<br>| SUMMARY:<br>| core-image-sato () - Ran 44 tests in 28.531s<br>| core-image-sato - FAIL - Required tests failed (skipped=19)<br>| ERROR: core-image-sato - FAILED - check the task log and the ssh log<br>| DEBUG: Python function do_testimage finished<br>| ERROR: Function failed: do_testimage<br>| Machine information:<br>| *******************************<br>| Machine name: qemux86-64<br>| CPU:  Intel(R) Core(TM)2 Duo CPU     T7700  @ 2.40GHz<br>| Arch: x86_64<br>| Physical cores: 1<br>| Logical cores: 1<br>| *******************************<br>| <br>ERROR: Task (/home/pokybuild/yocto-autobuilder/yocto-worker/nightly-qa-extras
 /build/meta/recipes-sato/images/core-image-sato.bb:do_testimage) failed with exit code '1'<br>Summary: There were 2 ERROR messages shown, returning a non-zero exit code.
</p>
<i>Detailed log of last build step:</i> <a href="https://autobuilder.yocto.io/builders/nightly-qa-extras/builds/813/steps/Running Sanity Tests_7/logs/stdio">https://autobuilder.yocto.io/builders/nightly-qa-extras/builds/813/steps/Running Sanity Tests_7/logs/stdio</a>
<br>
<h4>Last 60 lines of "Running Sanity Tests_7.stdio" Error log:</h4>
<p>
| RESULTS - connman.ConnmanTest.test_connmand_running - Testcase 221: PASSED<br>| RESULTS - date.DateTest.test_date - Testcase 211: PASSED<br>| RESULTS - df.DfTest.test_df - Testcase 234: PASSED<br>| RESULTS - dnf.DnfBasicTest.test_dnf_help - Testcase 1735: PASSED<br>| RESULTS - dnf.DnfBasicTest.test_dnf_history - Testcase 1736: PASSED<br>| RESULTS - dnf.DnfBasicTest.test_dnf_info - Testcase 1737: PASSED<br>| RESULTS - dnf.DnfBasicTest.test_dnf_search - Testcase 1738: PASSED<br>| RESULTS - dnf.DnfBasicTest.test_dnf_version - Testcase 1739: PASSED<br>| RESULTS - dnf.DnfRepoTest.test_dnf_install - Testcase 1740: PASSED<br>| RESULTS - dnf.DnfRepoTest.test_dnf_install_dependency - Testcase 1741: PASSED<br>| RESULTS - dnf.DnfRepoTest.test_dnf_install_from_disk - Testcase 1742: PASSED<br>| RESULTS - dnf.DnfRepoTest.test_dnf_install_from_http - Testcase 1743: PASSED<br>| RESULTS - dnf.DnfRepoTest.test_dnf_makecache - Testcase 1744: PASSED<br>| RESULTS - dnf.DnfRepoTest.test_dnf_reinstall - 
 Testcase 1745: PASSED<br>| RESULTS - dnf.DnfRepoTest.test_dnf_repoinfo - Testcase 1746: PASSED<br>| RESULTS - gi.GObjectIntrospectionTest.test_python - Testcase -1: SKIPPED<br>| RESULTS - oe_syslog.SyslogTest.test_syslog_running - Testcase 201: PASSED<br>| RESULTS - oe_syslog.SyslogTestConfig.test_syslog_logger - Testcase 1149: PASSED<br>| RESULTS - oe_syslog.SyslogTestConfig.test_syslog_restart - Testcase 1150: PASSED<br>| RESULTS - oe_syslog.SyslogTestConfig.test_syslog_startup_config - Testcase 202: SKIPPED<br>| RESULTS - parselogs.ParseLogsTest.test_parselogs - Testcase 1059: PASSED<br>| RESULTS - ping.PingTest.test_ping - Testcase 964: PASSED<br>| RESULTS - ptest.PtestRunnerTest.test_ptestrunner - Testcase 1600: FAILED<br>| RESULTS - python.PythonTest.test_python_exists - Testcase 1145: SKIPPED<br>| RESULTS - python.PythonTest.test_python_stdout - Testcase 965: SKIPPED<br>| RESULTS - python.PythonTest.test_python_testfile - Testcase 1146: SKIPPED<br>| RESULTS - rpm.RpmBasicTest
 .test_rpm_help - Testcase 960: PASSED<br>| RESULTS - rpm.RpmBasicTest.test_rpm_query - Testcase 191: PASSED<br>| RESULTS - rpm.RpmInstallRemoveTest.test_check_rpm_install_removal_log_file_size - Testcase 195: PASSED<br>| RESULTS - rpm.RpmInstallRemoveTest.test_rpm_install - Testcase 192: PASSED<br>| RESULTS - rpm.RpmInstallRemoveTest.test_rpm_query_nonroot - Testcase 1096: PASSED<br>| RESULTS - rpm.RpmInstallRemoveTest.test_rpm_remove - Testcase 194: PASSED<br>| RESULTS - scp.ScpTest.test_scp_file - Testcase 220: PASSED<br>| RESULTS - ssh.SSHTest.test_ssh - Testcase 224: PASSED<br>| RESULTS - systemd.SystemdBasicTests.test_systemd_basic - Testcase -1: PASSED<br>| RESULTS - systemd.SystemdBasicTests.test_systemd_failed - Testcase 550: PASSED<br>| RESULTS - systemd.SystemdBasicTests.test_systemd_list - Testcase 551: PASSED<br>| RESULTS - systemd.SystemdJournalTests.test_systemd_boot_time - Testcase -1: SKIPPED<br>| RESULTS - systemd.SystemdJournalTests.test_systemd_journal - Testcase 
 -1: PASSED<br>| RESULTS - systemd.SystemdServiceTests.test_systemd_disable_enable - Testcase 696: PASSED<br>| RESULTS - systemd.SystemdServiceTests.test_systemd_status - Testcase -1: PASSED<br>| RESULTS - systemd.SystemdServiceTests.test_systemd_stop_start - Testcase 695: PASSED<br>| RESULTS - xorg.XorgTest.test_xorg_running - Testcase 1151: PASSED<br>| SUMMARY:<br>| core-image-sato () - Ran 44 tests in 43.271s<br>| core-image-sato - FAIL - Required tests failed (skipped=6)<br>| ERROR: core-image-sato - FAILED - check the task log and the ssh log<br>| DEBUG: Python function do_testimage finished<br>| ERROR: Function failed: do_testimage<br>| Machine information:<br>| *******************************<br>| Machine name: qemux86-64<br>| CPU:  Intel(R) Core(TM)2 Duo CPU     T7700  @ 2.40GHz<br>| Arch: x86_64<br>| Physical cores: 1<br>| Logical cores: 1<br>| *******************************<br>| <br>ERROR: Task (/home/pokybuild/yocto-autobuilder/yocto-worker/nightly-qa-extras/build/meta/re
 cipes-sato/images/core-image-sato.bb:do_testimage) failed with exit code '1'<br>Summary: There were 2 ERROR messages shown, returning a non-zero exit code.
</p>
<br><br>
<b>-The Yocto BuildBot</b>