<h4>Build status: FAILURE</h4>
Build worker for this Build: <b>fedora26.yocto.io</b>
<br>
Complete logs for all build steps: <a href="https://autobuilder.yocto.io/builders/nightly-arm/builds/876">https://autobuilder.yocto.io/builders/nightly-arm/builds/876</a>
<br>
Build Reason: Triggerable(trigger_main-build)
<br>
Build Properties:<br>
<ul>
<li>Contents of bblayers.conf (Note. LCONF_VERSION will not show up correctly)<br><code>
POKY_BBLAYERS_CONF_VERSION = <PCONF> <br>
BBPATH = "${TOPDIR}" <br>
BBFILES ?="" <br>
BBLAYERS += " \ <br>
/home/pokybuild/yocto-autobuilder/yocto-worker/nightly-arm/build/meta \ <br>
/home/pokybuild/yocto-autobuilder/yocto-worker/nightly-arm/build/meta-poky \ <br>
/home/pokybuild/yocto-autobuilder/yocto-worker/nightly-arm/build/meta-yocto-bsp \ <br>
" <br>
<br></code></li>
<li>BuildImages : -c populate_sdk_ext core-image-minimal core-image-sato</li>
<li>DEST : /srv/autobuilder/autobuilder.yoctoproject.org/pub/nightly/20180228-5</li>
<li>DISTRO : poky</li>
<li>Contents of auto.conf (local.conf for autobuilders)<br><code>
INHERIT += "report-error"<br>
DISTRO = "poky"<br>
PACKAGE_CLASSES = "package_rpm package_deb package_ipk"<br>
BB_NUMBER_THREADS = "24"<br>
PARALLEL_MAKE = "-j 28"<br>
SDKMACHINE ?= "x86_64"<br>
BB_TASK_NICE_LEVEL = "5"<br>
BB_TASK_NICE_LEVEL_task-testimage = "0"<br>
BB_TASK_IONICE_LEVEL = "2.7"<br>
BB_TASK_IONICE_LEVEL_task-testimage = "2.1"<br>
DL_DIR = "/srv/autobuilder/autobuilder.yoctoproject.org/current_sources"<br>
SSTATE_DIR ?= "/srv/autobuilder/autobuilder.yoctoproject.org/pub/sstate/" <br>
MACHINE = "qemuarm"<br>
PREMIRRORS = ""<br>
BB_GENERATE_MIRROR_TARBALLS = "1"<br>
PRSERV_HOST = "localhost:0"<br>
ADTREPO = "http://adtrepo.yoctoproject.org//2.4+snapshot"<br>
QEMU_USE_KVM = "True"<br>
SDK_EXT_TYPE = "minimal"<br>
SDK_INCLUDE_TOOLCHAIN = "1"<br>
SANITY_TESTED_DISTROS = ""<br>
BB_DISKMON_DIRS = "\ <br>
STOPTASKS,${TMPDIR},1G,100K \ <br>
STOPTASKS,${DL_DIR},1G \ <br>
STOPTASKS,${SSTATE_DIR},1G \ <br>
STOPTASKS,/tmp,100M,100K \ <br>
ABORT,${TMPDIR},100M,1K \ <br>
ABORT,${DL_DIR},100M \ <br>
ABORT,${SSTATE_DIR},100M \ <br>
ABORT,/tmp,10M,1K"<br>
<br></code></li>
<li>MACHINE : qemuarm</li>
<li>bitbakeversion : 1.37.0</li>
<li>branch : ross/mut</li>
<li>branch_bitbake : master</li>
<li>branch_eclipse-poky-neon : neon-master</li>
<li>branch_eclipse-poky-oxygen : oxygen-master</li>
<li>branch_meta-gplv2 : master</li>
<li>branch_meta-intel : master</li>
<li>branch_meta-mingw : master</li>
<li>branch_meta-qt3 : master</li>
<li>branch_meta-qt4 : master</li>
<li>branch_oecore : master</li>
<li>branch_poky : ross/mut</li>
<li>builddir : /home/pokybuild/yocto-autobuilder/yocto-worker/nightly-arm</li>
<li>buildername : nightly-arm</li>
<li>buildnumber : 876</li>
<li>commit_bitbake : 34da85efb4cf76389f97d233571f79b733986ede</li>
<li>commit_eclipse-poky-neon : a5dbc01b96be55c4ec2f774af9996a8086e402ab</li>
<li>commit_eclipse-poky-oxygen : fbb91e5c5ad06470cd50ce1daa407a5f7d13c6ca</li>
<li>commit_meta-gplv2 : 138f6dd943f89604d38a7096def23ea02d55707a</li>
<li>commit_meta-intel : 9a4d583c7de4634a22104ca4c88ddf0d560494b6</li>
<li>commit_meta-mingw : 495a457d697653c0bf5d27809f372056614b8951</li>
<li>commit_meta-qt3 : f33b73a9563f2dfdfd0ee37b61d65d90197a456f</li>
<li>commit_meta-qt4 : f313dbee2ac3d5fcc9801407947d3cb6cfb90b5d</li>
<li>commit_oecore : b30153a15715a83c0f9a7d7d1883a15404992a19</li>
<li>commit_poky : 46f96bec6a63e54faf901d7d6a35f058305a71b6</li>
<li>commit_resolvedhead_bitbake : 34da85efb4cf76389f97d233571f79b733986ede</li>
<li>commit_resolvedhead_eclipse-poky-neon : a5dbc01b96be55c4ec2f774af9996a8086e402ab</li>
<li>commit_resolvedhead_eclipse-poky-oxygen : fbb91e5c5ad06470cd50ce1daa407a5f7d13c6ca</li>
<li>commit_resolvedhead_meta-gplv2 : 138f6dd943f89604d38a7096def23ea02d55707a</li>
<li>commit_resolvedhead_meta-intel : 9a4d583c7de4634a22104ca4c88ddf0d560494b6</li>
<li>commit_resolvedhead_meta-mingw : 495a457d697653c0bf5d27809f372056614b8951</li>
<li>commit_resolvedhead_meta-qt3 : f33b73a9563f2dfdfd0ee37b61d65d90197a456f</li>
<li>commit_resolvedhead_meta-qt4 : f313dbee2ac3d5fcc9801407947d3cb6cfb90b5d</li>
<li>commit_resolvedhead_oecore : b30153a15715a83c0f9a7d7d1883a15404992a19</li>
<li>commit_resolvedhead_poky : 46f96bec6a63e54faf901d7d6a35f058305a71b6</li>
<li>custom_create_eventlog : False</li>
<li>custom_deploy_artifacts : False</li>
<li>custom_yocto_number : None</li>
<li>distroversion : 2.4+snapshot</li>
<li>got_revision : 46f96bec6a63e54faf901d7d6a35f058305a71b6</li>
<li>got_revision_poky : 46f96bec6a63e54faf901d7d6a35f058305a71b6</li>
<li>is_release : False</li>
<li>layerversion_core : 11</li>
<li>layerversion_yocto : 3</li>
<li>layerversion_yoctobsp : 4</li>
<li>repo_bitbake : git://git.openembedded.org/bitbake</li>
<li>repo_eclipse-poky-neon : git://git.yoctoproject.org/eclipse-poky</li>
<li>repo_eclipse-poky-oxygen : git://git.yoctoproject.org/eclipse-poky</li>
<li>repo_meta-gplv2 : git://git.yoctoproject.org/meta-gplv2</li>
<li>repo_meta-intel : git://git.yoctoproject.org/meta-intel</li>
<li>repo_meta-mingw : git://git.yoctoproject.org/meta-mingw</li>
<li>repo_meta-qt3 : git://git.yoctoproject.org/meta-qt3</li>
<li>repo_meta-qt4 : git://git.yoctoproject.org/meta-qt4</li>
<li>repo_oecore : git://git.openembedded.org/openembedded-core</li>
<li>repo_poky : git://git.yoctoproject.org/poky-contrib</li>
<li>repository : git://git.yoctoproject.org/poky-contrib</li>
<li>repourl_poky : git://git.yoctoproject.org/poky-contrib</li>
<li>revision : 46f96bec6a63e54faf901d7d6a35f058305a71b6</li>
<li>scheduler : trigger_main-build</li>
<li>slavename : fedora26.yocto.io</li>
<li>workdir : /home/pokybuild/yocto-autobuilder/yocto-worker/nightly-arm</li>
</ul>
<i>Detailed log of last build step:</i> <a href="https://autobuilder.yocto.io/builders/nightly-arm/builds/876/steps/BuildImages/logs/stdio">https://autobuilder.yocto.io/builders/nightly-arm/builds/876/steps/BuildImages/logs/stdio</a>
<br>
<h4>Last 60 lines of "BuildImages.stdio" Error log:</h4>
<p>
ERROR: kernel-devsrc-1.0-r0 do_install: Function failed: do_install (log file is located at /home/pokybuild/yocto-autobuilder/yocto-worker/nightly-arm/build/build/tmp/work/qemuarm-poky-linux-gnueabi/kernel-devsrc/1.0-r0/temp/log.do_install.25822)<br>ERROR: Logfile of failure stored in: /home/pokybuild/yocto-autobuilder/yocto-worker/nightly-arm/build/build/tmp/work/qemuarm-poky-linux-gnueabi/kernel-devsrc/1.0-r0/temp/log.do_install.25822<br>| DEBUG: Executing python function extend_recipe_sysroot<br>| NOTE: Direct dependencies are ['/home/pokybuild/yocto-autobuilder/yocto-worker/nightly-arm/build/meta/recipes-devtools/binutils/binutils-cross_2.30.bb:do_populate_sysroot', 'virtual:native:/home/pokybuild/yocto-autobuilder/yocto-worker/nightly-arm/build/meta/recipes-extended/xz/xz_5.2.3.bb:do_populate_sysroot', 'virtual:native:/home/pokybuild/yocto-autobuilder/yocto-worker/nightly-arm/build/meta/recipes-devtools/pkgconfig/pkgconfig_git.bb:do_populate_sysroot', 'virtual:native:/home/pokyb
 uild/yocto-autobuilder/yocto-worker/nightly-arm/build/meta/recipes-support/lzop/lzop_1.03.bb:do_populate_sysroot', '/home/pokybuild/yocto-autobuilder/yocto-worker/nightly-arm/build/meta/recipes-kernel/kern-tools/kern-tools-native_git.bb:do_populate_sysroot', '/home/pokybuild/yocto-autobuilder/yocto-worker/nightly-arm/build/meta/recipes-devtools/gcc/gcc-runtime_7.3.bb:do_populate_sysroot', '/home/pokybuild/yocto-autobuilder/yocto-worker/nightly-arm/build/meta/recipes-devtools/gcc/gcc-cross_7.3.bb:do_populate_sysroot', 'virtual:native:/home/pokybuild/yocto-autobuilder/yocto-worker/nightly-arm/build/meta/recipes-devtools/bison/bison_3.0.4.bb:do_populate_sysroot', 'virtual:native:/home/pokybuild/yocto-autobuilder/yocto-worker/nightly-arm/build/meta/recipes-devtools/pseudo/pseudo_1.8.2.bb:do_populate_sysroot', '/home/pokybuild/yocto-autobuilder/yocto-worker/nightly-arm/build/meta/recipes-core/glibc/glibc_2.26.bb:do_populate_sysroot', '/home/pokybuild/yocto-autobuilder/yocto-worker/nightl
 y-arm/build/meta/recipes-kernel/kmod/kmod-native_git.bb:do_populate_sysroot', 'virtual:native:/home/pokybuild/yocto-autobuilder/yocto-worker/nightly-arm/build/meta/recipes-extended/bc/bc_1.06.bb:do_populate_sysroot', '/home/pokybuild/yocto-autobuilder/yocto-worker/nightly-arm/build/meta/recipes-devtools/quilt/quilt-native_0.65.bb:do_populate_sysroot', 'virtual:native:/home/pokybuild/yocto-autobuilder/yocto-worker/nightly-arm/build/meta/recipes-connectivity/openssl/openssl_1.0.2n.bb:do_populate_sysroot']<br>| NOTE: Installed into sysroot: ['pkgconfig-native', 'lzop-native', 'kern-tools-native', 'pseudo-native', 'kmod-native', 'bc-native', 'openssl-native', 'gtk-doc-native', 'lzo-native', 'makedepend-native', 'cryptodev-linux-native', 'util-macros-native', 'xproto-native']<br>| NOTE: Skipping as already exists in sysroot: ['binutils-cross-arm', 'xz-native', 'gcc-runtime', 'gcc-cross-arm', 'bison-native', 'glibc', 'quilt-native', 'gettext-minimal-native', 'gnu-config-native', 'automake
 -native', 'autoconf-native', 'libtool-native', 'linux-libc-headers', 'libgcc', 'zlib-native', 'texinfo-dummy-native', 'flex-native', 'libmpc-native', 'gmp-native', 'mpfr-native', 'm4-native']<br>| DEBUG: sed -e 's:^[^/]*/:/home/pokybuild/yocto-autobuilder/yocto-worker/nightly-arm/build/build/tmp/work/qemuarm-poky-linux-gnueabi/kernel-devsrc/1.0-r0/recipe-sysroot-native/:g' /home/pokybuild/yocto-autobuilder/yocto-worker/nightly-arm/build/build/tmp/sysroots-components/x86_64/pkgconfig-native/fixmepath /home/pokybuild/yocto-autobuilder/yocto-worker/nightly-arm/build/build/tmp/sysroots-components/x86_64/openssl-native/fixmepath /home/pokybuild/yocto-autobuilder/yocto-worker/nightly-arm/build/build/tmp/sysroots-components/x86_64/gtk-doc-native/fixmepath | xargs sed -i -e 's:FIXMESTAGINGDIRTARGET:/home/pokybuild/yocto-autobuilder/yocto-worker/nightly-arm/build/build/tmp/work/qemuarm-poky-linux-gnueabi/kernel-devsrc/1.0-r0/recipe-sysroot:g; s:FIXMESTAGINGDIRHOST:/home/pokybuild/yocto-autob
 uilder/yocto-worker/nightly-arm/build/build/tmp/work/qemuarm-poky-linux-gnueabi/kernel-devsrc/1.0-r0/recipe-sysroot-native:g' -e 's:FIXME_COMPONENTS_DIR:/home/pokybuild/yocto-autobuilder/yocto-worker/nightly-arm/build/build/tmp/sysroots-components:g' -e 's:FIXME_HOSTTOOLS_DIR:/home/pokybuild/yocto-autobuilder/yocto-worker/nightly-arm/build/build/tmp/hosttools:g' -e 's:FIXME_PKGDATA_DIR:/home/pokybuild/yocto-autobuilder/yocto-worker/nightly-arm/build/build/tmp/pkgdata/qemuarm:g' -e 's:FIXME_PSEUDO_LOCALSTATEDIR:/home/pokybuild/yocto-autobuilder/yocto-worker/nightly-arm/build/build/tmp/work/qemuarm-poky-linux-gnueabi/kernel-devsrc/1.0-r0/pseudo/:g' -e 's:FIXME_LOGFIFO:/home/pokybuild/yocto-autobuilder/yocto-worker/nightly-arm/build/build/tmp/work/qemuarm-poky-linux-gnueabi/kernel-devsrc/1.0-r0/temp/fifo.25822:g'<br>| DEBUG: Python function extend_recipe_sysroot finished<br>| DEBUG: Executing shell function do_install<br>| cp: with --parents, the destination must be a directory<br>| Tr
 y 'cp --help' for more information.<br>| WARNING: /home/pokybuild/yocto-autobuilder/yocto-worker/nightly-arm/build/build/tmp/work/qemuarm-poky-linux-gnueabi/kernel-devsrc/1.0-r0/temp/run.do_install.25822:1 exit 1 from 'rm -rf $kerneldir/build/include'<br>| ERROR: Function failed: do_install (log file is located at /home/pokybuild/yocto-autobuilder/yocto-worker/nightly-arm/build/build/tmp/work/qemuarm-poky-linux-gnueabi/kernel-devsrc/1.0-r0/temp/log.do_install.25822)<br>ERROR: Task (/home/pokybuild/yocto-autobuilder/yocto-worker/nightly-arm/build/meta/recipes-kernel/linux/kernel-devsrc.bb:do_install) failed with exit code '1'<br>Summary: There was 1 ERROR message shown, returning a non-zero exit code.
</p>
<i>Detailed log of last build step:</i> <a href="https://autobuilder.yocto.io/builders/nightly-arm/builds/876/steps/Running Sanity Tests/logs/stdio">https://autobuilder.yocto.io/builders/nightly-arm/builds/876/steps/Running Sanity Tests/logs/stdio</a>
<br>
<h4>Last 60 lines of "Running Sanity Tests.stdio" Error log:</h4>
<p>
| NOTE: FAILED<br>| NOTE:  (failures=1, skipped=4)<br>| DEBUG: Stopping logging thread<br>| DEBUG: Stop event received<br>| DEBUG: Tearing down logging thread<br>| DEBUG: Sending SIGTERM to runqemu<br>| RESULTS:<br>| RESULTS - connman.ConnmanTest.test_connmand_help - Testcase 961: PASSED<br>| RESULTS - connman.ConnmanTest.test_connmand_running - Testcase 221: PASSED<br>| RESULTS - date.DateTest.test_date - Testcase 211: PASSED<br>| RESULTS - df.DfTest.test_df - Testcase 234: PASSED<br>| RESULTS - dnf.DnfBasicTest.test_dnf_help - Testcase 1735: PASSED<br>| RESULTS - dnf.DnfBasicTest.test_dnf_history - Testcase 1736: PASSED<br>| RESULTS - dnf.DnfBasicTest.test_dnf_info - Testcase 1737: PASSED<br>| RESULTS - dnf.DnfBasicTest.test_dnf_search - Testcase 1738: PASSED<br>| RESULTS - dnf.DnfBasicTest.test_dnf_version - Testcase 1739: PASSED<br>| RESULTS - dnf.DnfRepoTest.test_dnf_install - Testcase 1740: PASSED<br>| RESULTS - dnf.DnfRepoTest.test_dnf_install_dependency - Testcase 1741: PASSE
 D<br>| RESULTS - dnf.DnfRepoTest.test_dnf_install_from_disk - Testcase 1742: PASSED<br>| RESULTS - dnf.DnfRepoTest.test_dnf_install_from_http - Testcase 1743: PASSED<br>| RESULTS - dnf.DnfRepoTest.test_dnf_makecache - Testcase 1744: PASSED<br>| RESULTS - dnf.DnfRepoTest.test_dnf_reinstall - Testcase 1745: PASSED<br>| RESULTS - dnf.DnfRepoTest.test_dnf_repoinfo - Testcase 1746: PASSED<br>| RESULTS - gi.GObjectIntrospectionTest.test_python - Testcase -1: SKIPPED<br>| RESULTS - oe_syslog.SyslogTest.test_syslog_running - Testcase 201: PASSED<br>| RESULTS - oe_syslog.SyslogTestConfig.test_syslog_logger - Testcase 1149: PASSED<br>| RESULTS - oe_syslog.SyslogTestConfig.test_syslog_restart - Testcase 1150: PASSED<br>| RESULTS - oe_syslog.SyslogTestConfig.test_syslog_startup_config - Testcase 202: PASSED<br>| RESULTS - parselogs.ParseLogsTest.test_parselogs - Testcase 1059: PASSED<br>| RESULTS - ping.PingTest.test_ping - Testcase 964: PASSED<br>| RESULTS - ptest.PtestRunnerTest.test_ptestrun
 ner - Testcase 1600: FAILED<br>| RESULTS - python.PythonTest.test_python_exists - Testcase 1145: SKIPPED<br>| RESULTS - python.PythonTest.test_python_stdout - Testcase 965: SKIPPED<br>| RESULTS - python.PythonTest.test_python_testfile - Testcase 1146: SKIPPED<br>| RESULTS - rpm.RpmBasicTest.test_rpm_help - Testcase 960: PASSED<br>| RESULTS - rpm.RpmBasicTest.test_rpm_query - Testcase 191: PASSED<br>| RESULTS - rpm.RpmInstallRemoveTest.test_check_rpm_install_removal_log_file_size - Testcase 195: PASSED<br>| RESULTS - rpm.RpmInstallRemoveTest.test_rpm_install - Testcase 192: PASSED<br>| RESULTS - rpm.RpmInstallRemoveTest.test_rpm_query_nonroot - Testcase 1096: PASSED<br>| RESULTS - rpm.RpmInstallRemoveTest.test_rpm_remove - Testcase 194: PASSED<br>| RESULTS - scp.ScpTest.test_scp_file - Testcase 220: PASSED<br>| RESULTS - ssh.SSHTest.test_ssh - Testcase 224: PASSED<br>| RESULTS - xorg.XorgTest.test_xorg_running - Testcase 1151: PASSED<br>| SUMMARY:<br>| core-image-sato () - Ran 36 tes
 ts in 1432.043s<br>| core-image-sato - FAIL - Required tests failed (skipped=4)<br>| ERROR: core-image-sato - FAILED - check the task log and the ssh log<br>| DEBUG: Python function do_testimage finished<br>| ERROR: Function failed: do_testimage<br>| Machine information:<br>| *******************************<br>| Machine name: qemuarm<br>| CPU:  ARM926EJ-S rev 5 (v5l)<br>| Arch: armv5tejl<br>| Physical cores:<br>| Logical cores: 1<br>| *******************************<br>| <br>ERROR: Task (/home/pokybuild/yocto-autobuilder/yocto-worker/nightly-arm/build/meta/recipes-sato/images/core-image-sato.bb:do_testimage) failed with exit code '1'<br>Summary: There were 4 ERROR messages shown, returning a non-zero exit code.
</p>
<i>Detailed log of last build step:</i> <a href="https://autobuilder.yocto.io/builders/nightly-arm/builds/876/steps/BuildImages_1/logs/stdio">https://autobuilder.yocto.io/builders/nightly-arm/builds/876/steps/BuildImages_1/logs/stdio</a>
<br>
<h4>Last 60 lines of "BuildImages_1.stdio" Error log:</h4>
<p>
ERROR: kernel-devsrc-1.0-r0 do_install: Function failed: do_install (log file is located at /home/pokybuild/yocto-autobuilder/yocto-worker/nightly-arm/build/build/tmp/work/beaglebone_yocto-poky-linux-gnueabi/kernel-devsrc/1.0-r0/temp/log.do_install.42329)<br>ERROR: Logfile of failure stored in: /home/pokybuild/yocto-autobuilder/yocto-worker/nightly-arm/build/build/tmp/work/beaglebone_yocto-poky-linux-gnueabi/kernel-devsrc/1.0-r0/temp/log.do_install.42329<br>| DEBUG: Executing python function extend_recipe_sysroot<br>| NOTE: Direct dependencies are ['virtual:native:/home/pokybuild/yocto-autobuilder/yocto-worker/nightly-arm/build/meta/recipes-extended/xz/xz_5.2.3.bb:do_populate_sysroot', 'virtual:native:/home/pokybuild/yocto-autobuilder/yocto-worker/nightly-arm/build/meta/recipes-connectivity/openssl/openssl_1.0.2n.bb:do_populate_sysroot', 'virtual:native:/home/pokybuild/yocto-autobuilder/yocto-worker/nightly-arm/build/meta/recipes-support/lzop/lzop_1.03.bb:do_populate_sysroot', '/home
 /pokybuild/yocto-autobuilder/yocto-worker/nightly-arm/build/meta/recipes-kernel/kern-tools/kern-tools-native_git.bb:do_populate_sysroot', '/home/pokybuild/yocto-autobuilder/yocto-worker/nightly-arm/build/meta/recipes-kernel/kmod/kmod-native_git.bb:do_populate_sysroot', '/home/pokybuild/yocto-autobuilder/yocto-worker/nightly-arm/build/meta/recipes-devtools/binutils/binutils-cross_2.30.bb:do_populate_sysroot', '/home/pokybuild/yocto-autobuilder/yocto-worker/nightly-arm/build/meta/recipes-core/glibc/glibc_2.26.bb:do_populate_sysroot', 'virtual:native:/home/pokybuild/yocto-autobuilder/yocto-worker/nightly-arm/build/meta/recipes-devtools/pseudo/pseudo_1.8.2.bb:do_populate_sysroot', '/home/pokybuild/yocto-autobuilder/yocto-worker/nightly-arm/build/meta/recipes-devtools/gcc/gcc-runtime_7.3.bb:do_populate_sysroot', '/home/pokybuild/yocto-autobuilder/yocto-worker/nightly-arm/build/meta/recipes-devtools/gcc/gcc-cross_7.3.bb:do_populate_sysroot', 'virtual:native:/home/pokybuild/yocto-autobuild
 er/yocto-worker/nightly-arm/build/meta/recipes-devtools/bison/bison_3.0.4.bb:do_populate_sysroot', 'virtual:native:/home/pokybuild/yocto-autobuilder/yocto-worker/nightly-arm/build/meta/recipes-devtools/pkgconfig/pkgconfig_git.bb:do_populate_sysroot', '/home/pokybuild/yocto-autobuilder/yocto-worker/nightly-arm/build/meta/recipes-devtools/quilt/quilt-native_0.65.bb:do_populate_sysroot', 'virtual:native:/home/pokybuild/yocto-autobuilder/yocto-worker/nightly-arm/build/meta/recipes-extended/bc/bc_1.06.bb:do_populate_sysroot']<br>| NOTE: Installed into sysroot: ['openssl-native', 'lzop-native', 'kern-tools-native', 'kmod-native', 'pseudo-native', 'pkgconfig-native', 'bc-native', 'makedepend-native', 'cryptodev-linux-native', 'lzo-native', 'gtk-doc-native', 'util-macros-native', 'xproto-native']<br>| NOTE: Skipping as already exists in sysroot: ['xz-native', 'binutils-cross-arm', 'glibc', 'gcc-runtime', 'gcc-cross-arm', 'bison-native', 'quilt-native', 'linux-libc-headers', 'libgcc', 'flex-
 native', 'automake-native', 'texinfo-dummy-native', 'gnu-config-native', 'gmp-native', 'libmpc-native', 'zlib-native', 'libtool-native', 'mpfr-native', 'autoconf-native', 'gettext-minimal-native', 'm4-native']<br>| DEBUG: sed -e 's:^[^/]*/:/home/pokybuild/yocto-autobuilder/yocto-worker/nightly-arm/build/build/tmp/work/beaglebone_yocto-poky-linux-gnueabi/kernel-devsrc/1.0-r0/recipe-sysroot-native/:g' /home/pokybuild/yocto-autobuilder/yocto-worker/nightly-arm/build/build/tmp/sysroots-components/x86_64/openssl-native/fixmepath /home/pokybuild/yocto-autobuilder/yocto-worker/nightly-arm/build/build/tmp/sysroots-components/x86_64/pkgconfig-native/fixmepath /home/pokybuild/yocto-autobuilder/yocto-worker/nightly-arm/build/build/tmp/sysroots-components/x86_64/gtk-doc-native/fixmepath | xargs sed -i -e 's:FIXMESTAGINGDIRTARGET:/home/pokybuild/yocto-autobuilder/yocto-worker/nightly-arm/build/build/tmp/work/beaglebone_yocto-poky-linux-gnueabi/kernel-devsrc/1.0-r0/recipe-sysroot:g; s:FIXMESTAGIN
 GDIRHOST:/home/pokybuild/yocto-autobuilder/yocto-worker/nightly-arm/build/build/tmp/work/beaglebone_yocto-poky-linux-gnueabi/kernel-devsrc/1.0-r0/recipe-sysroot-native:g' -e 's:FIXME_COMPONENTS_DIR:/home/pokybuild/yocto-autobuilder/yocto-worker/nightly-arm/build/build/tmp/sysroots-components:g' -e 's:FIXME_HOSTTOOLS_DIR:/home/pokybuild/yocto-autobuilder/yocto-worker/nightly-arm/build/build/tmp/hosttools:g' -e 's:FIXME_PKGDATA_DIR:/home/pokybuild/yocto-autobuilder/yocto-worker/nightly-arm/build/build/tmp/pkgdata/beaglebone-yocto:g' -e 's:FIXME_PSEUDO_LOCALSTATEDIR:/home/pokybuild/yocto-autobuilder/yocto-worker/nightly-arm/build/build/tmp/work/beaglebone_yocto-poky-linux-gnueabi/kernel-devsrc/1.0-r0/pseudo/:g' -e 's:FIXME_LOGFIFO:/home/pokybuild/yocto-autobuilder/yocto-worker/nightly-arm/build/build/tmp/work/beaglebone_yocto-poky-linux-gnueabi/kernel-devsrc/1.0-r0/temp/fifo.42329:g'<br>| DEBUG: Python function extend_recipe_sysroot finished<br>| DEBUG: Executing shell function do_inst
 all<br>| cp: with --parents, the destination must be a directory<br>| Try 'cp --help' for more information.<br>| WARNING: /home/pokybuild/yocto-autobuilder/yocto-worker/nightly-arm/build/build/tmp/work/beaglebone_yocto-poky-linux-gnueabi/kernel-devsrc/1.0-r0/temp/run.do_install.42329:1 exit 1 from 'rm -rf $kerneldir/build/include'<br>| ERROR: Function failed: do_install (log file is located at /home/pokybuild/yocto-autobuilder/yocto-worker/nightly-arm/build/build/tmp/work/beaglebone_yocto-poky-linux-gnueabi/kernel-devsrc/1.0-r0/temp/log.do_install.42329)<br>ERROR: Task (/home/pokybuild/yocto-autobuilder/yocto-worker/nightly-arm/build/meta/recipes-kernel/linux/kernel-devsrc.bb:do_install) failed with exit code '1'<br>Summary: There was 1 ERROR message shown, returning a non-zero exit code.
</p>
<br><br>
<b>-The Yocto BuildBot</b>