<h4>Build status: FAILURE</h4>
Build worker for this Build: <b>debian8.osl.yoctoproject.org</b>
<br>
Complete logs for all build steps: <a href="http://autobuilder.yoctoproject.org/main/builders/nightly-deb/builds/305">http://autobuilder.yoctoproject.org/main/builders/nightly-deb/builds/305</a>
<br>
Build Reason: Triggerable(trigger_main-build)
<br>
Build Properties:<br>
<ul>
<li>Contents of bblayers.conf (Note. LCONF_VERSION will not show up correctly)<br><code>
LCONF_VERSION = <LCONF> <br>
BBPATH = "${TOPDIR}" <br>
BBFILES ?="" <br>
BBLAYERS += " \ <br>
/home/pokybuild/yocto-autobuilder/yocto-worker/nightly-deb/build/meta \ <br>
/home/pokybuild/yocto-autobuilder/yocto-worker/nightly-deb/build/meta-yocto \ <br>
/home/pokybuild/yocto-autobuilder/yocto-worker/nightly-deb/build/meta-yocto-bsp \ <br>
/home/pokybuild/yocto-autobuilder/yocto-worker/nightly-deb/build/meta-qt3 \ <br>
" <br>
<br></code></li>
<li>DEST : /srv/www/vhosts/autobuilder.yoctoproject.org/pub/nightly/20150529-1</li>
<li>DISTRO : poky</li>
<li>Contents of auto.conf (local.conf for autobuilders)<br><code>
INHERIT += "toaster"<br>
INHERIT += "report-error"<br>
DISTRO = "poky"<br>
PACKAGE_CLASSES = "package_deb"<br>
BB_NUMBER_THREADS = "16"<br>
PARALLEL_MAKE = "-j 16"<br>
SDKMACHINE ?= "i686"<br>
BB_TASK_NICE_LEVEL = "5"<br>
IMAGE_FSTYPES_append = " tar.gz"<br>
BB_TASK_NICE_LEVEL_task-testimage = "0"<br>
DL_DIR = "/srv/www/vhosts/autobuilder.yoctoproject.org/current_sources"<br>
SSTATE_DIR ?= "/srv/www/vhosts/autobuilder.yoctoproject.org/pub/sstate/" <br>
MACHINE = "qemux86"<br>
PREMIRRORS = ""<br>
BB_GENERATE_MIRROR_TARBALLS = "1"<br>
ADTREPO = "http://adtrepo.yoctoproject.org//1.8+snapshot"<br>
<br></code></li>
<li>MACHINE : qemux86</li>
<li>branch : master-next</li>
<li>branch_bitbake : master</li>
<li>branch_eclipse-poky-juno : juno-master</li>
<li>branch_eclipse-poky-kepler : kepler-master</li>
<li>branch_eclipse-poky-luna : luna-master</li>
<li>branch_meta-fsl-arm : master</li>
<li>branch_meta-fsl-ppc : master</li>
<li>branch_meta-intel : master</li>
<li>branch_meta-minnow : master</li>
<li>branch_meta-qt3 : master</li>
<li>branch_oecore : master</li>
<li>branch_poky : master-next</li>
<li>builddir : /home/pokybuild/yocto-autobuilder/yocto-worker/nightly-deb</li>
<li>buildername : nightly-deb</li>
<li>buildnumber : 305</li>
<li>commit-description : yocto-1.7.2</li>
<li>commit_bitbake : a52242bb4d928b9abba8a3489e350e4615a9da29</li>
<li>commit_eclipse-poky-juno : f5e33fc79a3f77b0013c005019b72430d8998e8b</li>
<li>commit_eclipse-poky-kepler : 4c6d3defe86648c0321f832820b9cbc9ddf68742</li>
<li>commit_eclipse-poky-luna : fbabac5425731644a9cae4126771525c16a943f7</li>
<li>commit_meta-fsl-arm : f52c9106689f33c78b09496f4929ae1e87d13970</li>
<li>commit_meta-fsl-ppc : 36bd6ce8c63b8876c96fc1cd50e43863cdc2e44e</li>
<li>commit_meta-intel : f9738ec19d3b2864c0bd71b9bb3418d16e922a12</li>
<li>commit_meta-minnow : 00a39ed5a5f7037965ff674efe11277bd73416a5</li>
<li>commit_meta-qt3 : 3016129d90b7ac8517a5227d819f10ad417b5b45</li>
<li>commit_oecore : 20de4a069c7226f60becafd14b88a8439e4da1c2</li>
<li>commit_poky : 3bab6127758854542e07edacaeb849b30b0dca86</li>
<li>commit_resolvedhead_bitbake : a52242bb4d928b9abba8a3489e350e4615a9da29</li>
<li>commit_resolvedhead_eclipse-poky-juno : f5e33fc79a3f77b0013c005019b72430d8998e8b</li>
<li>commit_resolvedhead_eclipse-poky-kepler : 4c6d3defe86648c0321f832820b9cbc9ddf68742</li>
<li>commit_resolvedhead_eclipse-poky-luna : fbabac5425731644a9cae4126771525c16a943f7</li>
<li>commit_resolvedhead_meta-fsl-arm : f52c9106689f33c78b09496f4929ae1e87d13970</li>
<li>commit_resolvedhead_meta-fsl-ppc : 36bd6ce8c63b8876c96fc1cd50e43863cdc2e44e</li>
<li>commit_resolvedhead_meta-intel : f9738ec19d3b2864c0bd71b9bb3418d16e922a12</li>
<li>commit_resolvedhead_meta-minnow : 00a39ed5a5f7037965ff674efe11277bd73416a5</li>
<li>commit_resolvedhead_meta-qt3 : 3016129d90b7ac8517a5227d819f10ad417b5b45</li>
<li>commit_resolvedhead_oecore : 20de4a069c7226f60becafd14b88a8439e4da1c2</li>
<li>commit_resolvedhead_poky : 3bab6127758854542e07edacaeb849b30b0dca86</li>
<li>distroversion : 1.8+snapshot</li>
<li>got_revision : 3bab6127758854542e07edacaeb849b30b0dca86</li>
<li>got_revision_meta-qt3 : 3016129d90b7ac8517a5227d819f10ad417b5b45</li>
<li>got_revision_poky : 3bab6127758854542e07edacaeb849b30b0dca86</li>
<li>layerversion_core : 5</li>
<li>layerversion_yoctobsp : 3</li>
<li>repo_bitbake : git://git.openembedded.org/bitbake</li>
<li>repo_eclipse-poky-juno : git://git.yoctoproject.org/eclipse-poky</li>
<li>repo_eclipse-poky-kepler : git://git.yoctoproject.org/eclipse-poky</li>
<li>repo_eclipse-poky-luna : git://git.yoctoproject.org/eclipse-poky</li>
<li>repo_meta-fsl-arm : git://git.yoctoproject.org/meta-fsl-arm</li>
<li>repo_meta-fsl-ppc : git://git.yoctoproject.org/meta-fsl-ppc</li>
<li>repo_meta-intel : git://git.yoctoproject.org/meta-intel</li>
<li>repo_meta-minnow : git://git.yoctoproject.org/meta-minnow</li>
<li>repo_meta-qt3 : git://git.yoctoproject.org/meta-qt3</li>
<li>repo_oecore : git://git.openembedded.org/openembedded-core</li>
<li>repo_poky : git://git.yoctoproject.org/poky</li>
<li>repository : git://git.yoctoproject.org/poky</li>
<li>repourl_meta-qt3 : git://git.yoctoproject.org/meta-qt3</li>
<li>repourl_poky : git://git.yoctoproject.org/poky</li>
<li>revision : 3bab6127758854542e07edacaeb849b30b0dca86</li>
<li>scheduler : trigger_main-build</li>
<li>slavename : debian8.osl.yoctoproject.org</li>
<li>workdir : /home/pokybuild/yocto-autobuilder/yocto-worker/nightly-deb</li>
</ul>
<i>Detailed log of last build step:</i> <a href="http://autobuilder.yoctoproject.org/main/builders/nightly-deb/builds/305/steps/Running Sanity Tests_1/logs/stdio">http://autobuilder.yoctoproject.org/main/builders/nightly-deb/builds/305/steps/Running Sanity Tests_1/logs/stdio</a>
<br>
<h4>Last 60 lines of "Running Sanity Tests_1.stdio" Error log:</h4>
<p>
| Arch: i686<br>| Physical cores: 1<br>| Logical cores: 1<br>| *******************************<br>| <br>| FAIL<br>| test_perl_exists (oeqa.runtime.perl.PerlTest) ... ok<br>| test_perl_works (oeqa.runtime.perl.PerlTest) ... ok<br>| skipped 'python: No python package in the image'<br>| skipped "rpm: rpm module skipped: target doesn't have rpm as primary package manager"<br>| skipped 'scanelf: pax-utils package not installed'<br>| test_scp_file (oeqa.runtime.scp.ScpTest) ... ok<br>| skipped "smart: Image doesn't have smart installed"<br>| test_vnc (oeqa.runtime.vnc.VNCTest) ... ok<br>| skipped 'x32lib: DEFAULTTUNE is not set to x86-64-x32'<br>| test_connmand_help (oeqa.runtime.connman.ConnmanTest) ... ok<br>| test_connmand_running (oeqa.runtime.connman.ConnmanTest) ... ok<br>| skipped 'logrotate: No logrotate package in image'<br>| skipped 'skeletoninit: No service package in image'<br>| test_syslog_help (oeqa.runtime.syslog.SyslogTest) ... ok<br>| test_syslog_running (oeqa.runtime.sysl
 og.SyslogTest) ... ok<br>| test_syslog_logger (oeqa.runtime.syslog.SyslogTestConfig) ... ok<br>| test_syslog_restart (oeqa.runtime.syslog.SyslogTestConfig) ... ok<br>| test_syslog_startup_config (oeqa.runtime.syslog.SyslogTestConfig) ... ok<br>| skipped "systemd: target doesn't have systemd in DISTRO_FEATURES"<br>| test_xorg_running (oeqa.runtime.xorg.XorgTest) ... ok<br>| <br>| ======================================================================<br>| FAIL: test_parselogs (oeqa.runtime.parselogs.ParseLogsTest)<br>| ----------------------------------------------------------------------<br>| Traceback (most recent call last):<br>|   File "/home/pokybuild/yocto-autobuilder/yocto-worker/nightly-deb/build/meta/lib/oeqa/utils/decorators.py", line 100, in wrapped_f<br>|     return func(*args)<br>|   File "/home/pokybuild/yocto-autobuilder/yocto-worker/nightly-deb/build/meta/lib/oeqa/utils/decorators.py", line 88, in wrapped_f<br>|     return f(*args)<br>|   File "/home/pokybuild/yocto-au
 tobuilder/yocto-worker/nightly-deb/build/meta/lib/oeqa/runtime/parselogs.py", line 213, in test_parselogs<br>|     self.assertEqual(errcount, 0, msg=self.msg)<br>| AssertionError: 2 != 0 : Log: /var/log/dmesg<br>| -----------------------<br>| Central error: exec request failed on channel 0<br>| ***********************<br>| <br>| ***********************<br>| Log: /var/log//Xorg.0.log<br>| -----------------------<br>| Central error: exec request failed on channel 0<br>| ***********************<br>| <br>| ***********************<br>| 2 errors found in logs.<br>| <br>| ----------------------------------------------------------------------<br>| Ran 18 tests in 40.624s<br>| <br>| FAILED (failures=1, skipped=16)<br>| NOTE: Sending SIGTERM to runqemu<br>| DEBUG: Python function do_testimage finished<br>| ERROR: Function failed: core-image-sato - FAILED - check the task log and the ssh log<br>ERROR: Task 0 (/home/pokybuild/yocto-autobuilder/yocto-worker/nightly-deb/build/meta/recipes-sato/im
 ages/core-image-sato.bb, do_testimage) failed with exit code '1'<br>Summary: There was 1 ERROR message shown, returning a non-zero exit code.
</p>
<br><br>
<b>-The Yocto BuildBot</b>