<h4>Build status: FAILURE</h4>
Build worker for this Build: <b>fedora20.osl.yoctoproject.org</b>
<br>
Complete logs for all build steps: <a href="http://autobuilder.yoctoproject.org/main/builders/nightly-arm64/builds/5">http://autobuilder.yoctoproject.org/main/builders/nightly-arm64/builds/5</a>
<br>
Build Reason: A build was forced by 'richard <richard@localhost>': 
<br>
Build Properties:<br>
<ul>
<li>Contents of bblayers.conf (Note. LCONF_VERSION will not show up correctly)<br><code>
LCONF_VERSION = <LCONF> <br>
BBPATH = "${TOPDIR}" <br>
BBFILES ?="" <br>
BBLAYERS += " \ <br>
/home/pokybuild/yocto-autobuilder/yocto-worker/nightly-arm64/build/meta \ <br>
/home/pokybuild/yocto-autobuilder/yocto-worker/nightly-arm64/build/meta-yocto \ <br>
/home/pokybuild/yocto-autobuilder/yocto-worker/nightly-arm64/build/meta-yocto-bsp \ <br>
/home/pokybuild/yocto-autobuilder/yocto-worker/nightly-arm64/build/meta-qt3 \ <br>
" <br>
<br></code></li>
<li>DEST : /srv/www/vhosts/autobuilder.yoctoproject.org/pub/nightly-arm64/20150101-1</li>
<li>Contents of auto.conf (local.conf for autobuilders)<br><code>
INHERIT += "report-error"<br>
DISTRO = "poky"<br>
PACKAGE_CLASSES = "package_rpm package_deb package_ipk"<br>
BB_NUMBER_THREADS = "16"<br>
PARALLEL_MAKE = "-j 16"<br>
SDKMACHINE ?= "x86_64"<br>
BB_TASK_NICE_LEVEL = "5"<br>
IMAGE_FSTYPES_append = " tar.gz"<br>
BB_TASK_NICE_LEVEL_task-testimage = "0"<br>
DL_DIR = "/srv/www/vhosts/autobuilder.yoctoproject.org/current_sources"<br>
SSTATE_DIR ?= "/srv/www/vhosts/autobuilder.yoctoproject.org/pub/sstate/" <br>
MACHINE = "qemuarm64"<br>
PREMIRRORS = ""<br>
BB_GENERATE_MIRROR_TARBALLS = "1"<br>
ADTREPO = "http://adtrepo.yoctoproject.org//1.7"<br>
<br></code></li>
<li>MACHINE : qemuarm64</li>
<li>branch : master-next</li>
<li>branch_meta-qt3 : master</li>
<li>branch_poky : master-next</li>
<li>builddir : /home/pokybuild/yocto-autobuilder/yocto-worker/nightly-arm64</li>
<li>buildername : nightly-arm64</li>
<li>buildnumber : 5</li>
<li>commit-description : daisy-11.0.2</li>
<li>commit_meta-qt3 : 3016129d90b7ac8517a5227d819f10ad417b5b45</li>
<li>commit_poky : bdc842893a45e03436a3639fbb4d8207420af27a</li>
<li>commit_resolvedhead_meta-qt3 : 3016129d90b7ac8517a5227d819f10ad417b5b45</li>
<li>commit_resolvedhead_poky : bdc842893a45e03436a3639fbb4d8207420af27a</li>
<li>distroversion : 1.7</li>
<li>got_revision : bdc842893a45e03436a3639fbb4d8207420af27a</li>
<li>got_revision_meta-qt3 : 3016129d90b7ac8517a5227d819f10ad417b5b45</li>
<li>got_revision_poky : bdc842893a45e03436a3639fbb4d8207420af27a</li>
<li>layerversion_core : 4</li>
<li>layerversion_yoctobsp : 3</li>
<li>owner : richard <richard@localhost></li>
<li>owners : [u'richard <richard@localhost>']</li>
<li>repo_meta-qt3 : git://git.yoctoproject.org/meta-qt3</li>
<li>repo_poky : git://git.yoctoproject.org/poky</li>
<li>repository : git://git.yoctoproject.org/poky</li>
<li>repourl_meta-qt3 : git://git.yoctoproject.org/meta-qt3</li>
<li>repourl_poky : git://git.yoctoproject.org/poky</li>
<li>revision : bdc842893a45e03436a3639fbb4d8207420af27a</li>
<li>scheduler : nightly-arm64</li>
<li>slavename : fedora20.osl.yoctoproject.org</li>
<li>workdir : /home/pokybuild/yocto-autobuilder/yocto-worker/nightly-arm64</li>
</ul>
<i>Detailed log of last build step:</i> <a href="http://autobuilder.yoctoproject.org/main/builders/nightly-arm64/builds/5/steps/Running Sanity Tests/logs/stdio">http://autobuilder.yoctoproject.org/main/builders/nightly-arm64/builds/5/steps/Running Sanity Tests/logs/stdio</a>
<br>
<h4>Last 60 lines of "Running Sanity Tests.stdio" Error log:</h4>
<p>
| No ignore list found for this machine, using default<br>| No ignore list found for this machine, using default<br>| Log: /var/log//Xorg.0.log<br>| -----------------------<br>| Central error: Fatal server error:<br>| ***********************<br>| [2780875.954] (WW) Falling back to old probe method for fbdev<br>| [2780875.954] (II) Loading sub module "fbdevhw"<br>| [2780875.954] (II) LoadModule: "fbdevhw"<br>| [2780875.955] (II) Loading /usr/lib/xorg/modules/libfbdevhw.so<br>| [2780875.957] (II) Module fbdevhw: vendor="X.Org Foundation"<br>| [2780875.957]        compiled for 1.16.2, module version = 0.0.2<br>| [2780875.957]    ABI class: X.Org Video Driver, version 18.0<br>| [2780875.958] (EE) open /dev/fb0: No such file or directory<br>| [2780875.958] (EE) No devices detected.<br>| [2780875.959] (EE)<br>| Fatal server error:<br>| [2780875.970] (EE) no screens found(EE)<br>| [2780875.978] (EE)<br>| Please consult the The X.Org Foundation support<br>|        at http://wiki.x.org<br>|  for help.<br>
 | [2780875.979] (EE) Please also check the log file at "/var/log/Xorg.0.log" for additional information.<br>| [2780875.981] (EE)<br>| [2780875.989] (EE) Server terminated with error (1). Closing log file.<br>| ***********************<br>| Central error: [2780875.989] (EE) Server terminated with error (1). Closing log file.<br>| ***********************<br>| [2780875.958] (EE) No devices detected.<br>| [2780875.959] (EE)<br>| Fatal server error:<br>| [2780875.970] (EE) no screens found(EE)<br>| [2780875.978] (EE)<br>| Please consult the The X.Org Foundation support<br>|        at http://wiki.x.org<br>|  for help.<br>| [2780875.979] (EE) Please also check the log file at "/var/log/Xorg.0.log" for additional information.<br>| [2780875.981] (EE)<br>| [2780875.989] (EE) Server terminated with error (1). Closing log file.<br>| ***********************<br>| 2 errors found in logs.<br>| <br>| ----------------------------------------------------------------------<br>| Ran 49 tests in 763.570s<br>| 
 <br>| FAILED (failures=2)<br>| NOTE: Sending SIGTERM to runqemu<br>| DEBUG: Python function do_testimage finished<br>| ERROR: Function failed: core-image-sato-sdk - FAILED - check the task log and the ssh log<br>| Machine information:<br>| *******************************<br>| Machine name: qemuarm64<br>| CPU:<br>| Arch: aarch64<br>| Physical cores:<br>| Logical cores: 0<br>| *******************************<br>| <br>ERROR: Task 2 (/home/pokybuild/yocto-autobuilder/yocto-worker/nightly-arm64/build/meta/recipes-sato/images/core-image-sato-sdk.bb, do_testimage) failed with exit code '1'<br>Summary: There were 2 ERROR messages shown, returning a non-zero exit code.
</p>
<br><br>
<b>-The Yocto BuildBot</b>