<h4>Build status: FAILURE</h4>
Build worker for this Build: <b>opensuse131-a.osl.yoctoproject.org</b>
<br>
Complete logs for all build steps: <a href="http://autobuilder.yoctoproject.org/main/builders/nightly-ipk/builds/55">http://autobuilder.yoctoproject.org/main/builders/nightly-ipk/builds/55</a>
<br>
Build Reason: Triggerable(trigger_main-build)
<br>
Build Properties:<br>
<ul>
<li>Contents of bblayers.conf (Note. LCONF_VERSION will not show up correctly)<br><code>
LCONF_VERSION = <LCONF> <br>
BBPATH = "${TOPDIR}" <br>
BBFILES ?="" <br>
BBLAYERS += " \ <br>
/home/pokybuild/yocto-autobuilder/yocto-worker/nightly-ipk/build/meta \ <br>
/home/pokybuild/yocto-autobuilder/yocto-worker/nightly-ipk/build/meta-yocto \ <br>
/home/pokybuild/yocto-autobuilder/yocto-worker/nightly-ipk/build/meta-yocto-bsp \ <br>
/home/pokybuild/yocto-autobuilder/yocto-worker/nightly-ipk/build/meta-qt3 \ <br>
" <br>
<br></code></li>
<li>DEST : /srv/www/vhosts/autobuilder.yoctoproject.org/pub/nightly/20141001-3</li>
<li>Contents of auto.conf (local.conf for autobuilders)<br><code>
INHERIT += "report-error"<br>
DISTRO = "poky"<br>
PACKAGE_CLASSES = "package_ipk"<br>
BB_NUMBER_THREADS = "16"<br>
PARALLEL_MAKE = "-j 16"<br>
SDKMACHINE ?= "i686"<br>
BB_TASK_NICE_LEVEL = "5"<br>
IMAGE_FSTYPES_append = " tar.gz"<br>
BB_TASK_NICE_LEVEL_task-testimage = "0"<br>
DL_DIR = "/srv/www/vhosts/autobuilder.yoctoproject.org/current_sources"<br>
SSTATE_DIR ?= "/srv/www/vhosts/autobuilder.yoctoproject.org/pub/sstate/" <br>
MACHINE = "qemux86"<br>
PREMIRRORS = ""<br>
BB_GENERATE_MIRROR_TARBALLS = "1"<br>
ADTREPO = "http://adtrepo.yoctoproject.org//1.7"<br>
<br></code></li>
<li>MACHINE : qemux86</li>
<li>branch : master-next</li>
<li>branch_bitbake : master</li>
<li>branch_eclipse-poky-juno : master</li>
<li>branch_eclipse-poky-kepler : master</li>
<li>branch_meta-fsl-arm : master</li>
<li>branch_meta-fsl-ppc : master</li>
<li>branch_meta-intel : master</li>
<li>branch_meta-minnow : master</li>
<li>branch_meta-qt3 : master</li>
<li>branch_oecore : master</li>
<li>branch_poky : master-next</li>
<li>builddir : /home/pokybuild/yocto-autobuilder/yocto-worker/nightly-ipk</li>
<li>buildername : nightly-ipk</li>
<li>buildnumber : 55</li>
<li>commit-description : daisy-11.0.1</li>
<li>commit_bitbake : afa2431c21b8271b05dc4cca4265f98d9f338007</li>
<li>commit_eclipse-poky-juno : 26bfc407781aa185f244a47ba63120343cee4a37</li>
<li>commit_eclipse-poky-kepler : 4a167fd662262ebdaa3cf0d332ac0debb52d7904</li>
<li>commit_meta-fsl-arm : 2680f54d02fa6efe4cd2aaef7bda9e46cf3e9672</li>
<li>commit_meta-fsl-ppc : deb326df1489d4844f911605a2627f95c89b167f</li>
<li>commit_meta-intel : 9f815ab761e6b524625e4180397233eeb728f84e</li>
<li>commit_meta-minnow : 13a5f2ab84c7284647a3e067a33109c11dae0568</li>
<li>commit_meta-qt3 : 3016129d90b7ac8517a5227d819f10ad417b5b45</li>
<li>commit_oecore : ae8319fb460b5d588044f6b00bf73255773f4ff0</li>
<li>commit_poky : dc175619cf1d7101c7bc2ce016fec3d251bf7acd</li>
<li>commit_resolvedhead_bitbake : afa2431c21b8271b05dc4cca4265f98d9f338007</li>
<li>commit_resolvedhead_eclipse-poky-juno : 26bfc407781aa185f244a47ba63120343cee4a37</li>
<li>commit_resolvedhead_eclipse-poky-kepler : 4a167fd662262ebdaa3cf0d332ac0debb52d7904</li>
<li>commit_resolvedhead_meta-fsl-arm : 2680f54d02fa6efe4cd2aaef7bda9e46cf3e9672</li>
<li>commit_resolvedhead_meta-fsl-ppc : deb326df1489d4844f911605a2627f95c89b167f</li>
<li>commit_resolvedhead_meta-intel : 9f815ab761e6b524625e4180397233eeb728f84e</li>
<li>commit_resolvedhead_meta-minnow : 13a5f2ab84c7284647a3e067a33109c11dae0568</li>
<li>commit_resolvedhead_meta-qt3 : 3016129d90b7ac8517a5227d819f10ad417b5b45</li>
<li>commit_resolvedhead_oecore : ae8319fb460b5d588044f6b00bf73255773f4ff0</li>
<li>commit_resolvedhead_poky : dc175619cf1d7101c7bc2ce016fec3d251bf7acd</li>
<li>distroversion : 1.7</li>
<li>got_revision : dc175619cf1d7101c7bc2ce016fec3d251bf7acd</li>
<li>got_revision_meta-qt3 : 3016129d90b7ac8517a5227d819f10ad417b5b45</li>
<li>got_revision_poky : dc175619cf1d7101c7bc2ce016fec3d251bf7acd</li>
<li>layerversion_core : 4</li>
<li>layerversion_yoctobsp : 3</li>
<li>repo_bitbake : git://git.openembedded.org/bitbake</li>
<li>repo_eclipse-poky-juno : git://git.yoctoproject.org/eclipse-poky-juno</li>
<li>repo_eclipse-poky-kepler : git://git.yoctoproject.org/eclipse-poky-kepler</li>
<li>repo_meta-fsl-arm : git://git.yoctoproject.org/meta-fsl-arm</li>
<li>repo_meta-fsl-ppc : git://git.yoctoproject.org/meta-fsl-ppc</li>
<li>repo_meta-intel : git://git.yoctoproject.org/meta-intel</li>
<li>repo_meta-minnow : git://git.yoctoproject.org/meta-minnow</li>
<li>repo_meta-qt3 : git://git.yoctoproject.org/meta-qt3</li>
<li>repo_oecore : git://git.openembedded.org/openembedded-core</li>
<li>repo_poky : git://git.yoctoproject.org/poky</li>
<li>repository : git://git.yoctoproject.org/poky</li>
<li>repourl_meta-qt3 : git://git.yoctoproject.org/meta-qt3</li>
<li>repourl_poky : git://git.yoctoproject.org/poky</li>
<li>revision : dc175619cf1d7101c7bc2ce016fec3d251bf7acd</li>
<li>scheduler : trigger_main-build</li>
<li>slavename : opensuse131-a.osl.yoctoproject.org</li>
<li>workdir : /home/pokybuild/yocto-autobuilder/yocto-worker/nightly-ipk</li>
</ul>
<i>Detailed log of last build step:</i> <a href="http://autobuilder.yoctoproject.org/main/builders/nightly-ipk/builds/55/steps/Running Sanity Tests_1/logs/stdio">http://autobuilder.yoctoproject.org/main/builders/nightly-ipk/builds/55/steps/Running Sanity Tests_1/logs/stdio</a>
<br>
<h4>Last 60 lines of "Running Sanity Tests_1.stdio" Error log:</h4>
<p>
ERROR: Loading tests failed:<br>ERROR: Function failed: do_testimage<br>ERROR: Logfile of failure stored in: /home/pokybuild/yocto-autobuilder/yocto-worker/nightly-ipk/build/build/tmp/work/qemux86-poky-linux/core-image-sato/1.0-r0/temp/log.do_testimage.7851<br>ERROR: Task 0 (/home/pokybuild/yocto-autobuilder/yocto-worker/nightly-ipk/build/meta/recipes-sato/images/core-image-sato.bb, do_testimage) failed with exit code '1'<br>Summary: There were 2 ERROR messages shown, returning a non-zero exit code.
</p>
<i>Detailed log of last build step:</i> <a href="http://autobuilder.yoctoproject.org/main/builders/nightly-ipk/builds/55/steps/Running Sanity Tests_2/logs/stdio">http://autobuilder.yoctoproject.org/main/builders/nightly-ipk/builds/55/steps/Running Sanity Tests_2/logs/stdio</a>
<br>
<h4>Last 60 lines of "Running Sanity Tests_2.stdio" Error log:</h4>
<p>
| test_ldd_rtldlist_check (oeqa.runtime.ldd.LddTest) ... ok<br>| test_gcc_compile (oeqa.runtime.gcc.GccCompileTest) ... ok<br>| test_gpp2_compile (oeqa.runtime.gcc.GccCompileTest) ... ok<br>| test_gpp_compile (oeqa.runtime.gcc.GccCompileTest) ... ok<br>| test_make (oeqa.runtime.gcc.GccCompileTest) ... ok<br>| test_kernel_module (oeqa.runtime.kernelmodule.KernelModuleTest) ... ok<br>| test_dmesg (oeqa.runtime.dmesg.DmesgTest) ... FAIL<br>| test_python_exists (oeqa.runtime.python.PythonTest) ... FAIL<br>| test_python_stdout (oeqa.runtime.python.PythonTest) ... FAIL<br>| test_python_testfile (oeqa.runtime.python.PythonTest) ... FAIL<br>| <br>| ======================================================================<br>| FAIL: test_dmesg (oeqa.runtime.dmesg.DmesgTest)<br>| ----------------------------------------------------------------------<br>| Traceback (most recent call last):<br>|   File "/home/pokybuild/yocto-autobuilder/yocto-worker/nightly-ipk/build/meta/lib/oeqa/utils/decorators.
 py", line 90, in wrapped_f<br>|     return func(*args)<br>|   File "/home/pokybuild/yocto-autobuilder/yocto-worker/nightly-ipk/build/meta/lib/oeqa/utils/decorators.py", line 79, in wrapped_f<br>|     return f(*args)<br>|   File "/home/pokybuild/yocto-autobuilder/yocto-worker/nightly-ipk/build/meta/lib/oeqa/runtime/dmesg.py", line 12, in test_dmesg<br>|     self.assertEqual(status, 1, msg = "Error messages in dmesg log: %s" % output)<br>| AssertionError: 0 != 1 : Error messages in dmesg log: [   20.194174] usbhid: probe of 1-1:1.0 failed with error -32<br>| <br>| ======================================================================<br>| FAIL: test_python_exists (oeqa.runtime.python.PythonTest)<br>| ----------------------------------------------------------------------<br>| Traceback (most recent call last):<br>|   File "/home/pokybuild/yocto-autobuilder/yocto-worker/nightly-ipk/build/meta/lib/oeqa/runtime/python.py", line 19, in test_python_exists<br>|     self.assertEqual(status, 0
 , msg="Python binary not in PATH or not on target.")<br>| AssertionError: 1 != 0 : Python binary not in PATH or not on target.<br>| <br>| ======================================================================<br>| FAIL: test_python_stdout (oeqa.runtime.python.PythonTest)<br>| ----------------------------------------------------------------------<br>| Traceback (most recent call last):<br>|   File "/home/pokybuild/yocto-autobuilder/yocto-worker/nightly-ipk/build/meta/lib/oeqa/utils/decorators.py", line 90, in wrapped_f<br>|     return func(*args)<br>|   File "/home/pokybuild/yocto-autobuilder/yocto-worker/nightly-ipk/build/meta/lib/oeqa/runtime/python.py", line 24, in test_python_stdout<br>|     self.assertEqual(status, 0, msg="Exit status was not 0. Output: %s" % output)<br>| AssertionError: 126 != 0 : Exit status was not 0. Output: sh: /usr/bin/python: Permission denied<br>| <br>| ======================================================================<br>| FAIL: test_python_testfile
  (oeqa.runtime.python.PythonTest)<br>| ----------------------------------------------------------------------<br>| Traceback (most recent call last):<br>|   File "/home/pokybuild/yocto-autobuilder/yocto-worker/nightly-ipk/build/meta/lib/oeqa/runtime/python.py", line 29, in test_python_testfile<br>|     self.assertEqual(status, 0, msg="Python test file generate failed.")<br>| AssertionError: 2 != 0 : Python test file generate failed.<br>| <br>| ----------------------------------------------------------------------<br>| Ran 27 tests in 135.288s<br>| <br>| FAILED (failures=4)<br>| NOTE: Sending SIGTERM to runqemu<br>| DEBUG: Python function do_testimage finished<br>| ERROR: Function failed: core-image-sato-sdk - FAILED - check the task log and the ssh log<br>| Test modules  ['oeqa.runtime.ping', 'oeqa.runtime.ssh', 'oeqa.runtime.df', 'oeqa.runtime.connman', 'oeqa.runtime.syslog', 'oeqa.runtime.xorg', 'oeqa.runtime.scp', 'oeqa.runtime.vnc', 'oeqa.runtime.date', 'oeqa.runtime.perl', 'oeq
 a.runtime.ldd', 'oeqa.runtime.gcc', 'oeqa.runtime.kernelmodule', 'oeqa.runtime.dmesg', 'oeqa.runtime.python']<br>| Found 27 tests<br>ERROR: Task 0 (/home/pokybuild/yocto-autobuilder/yocto-worker/nightly-ipk/build/meta/recipes-sato/images/core-image-sato-sdk.bb, do_testimage) failed with exit code '1'<br>Summary: There was 1 ERROR message shown, returning a non-zero exit code.
</p>
<br><br>
<b>-The Yocto BuildBot</b>