<h4>Build status: FAILURE</h4>
Buildslave for this Build: <b>ab05.i.yoctoproject.org</b>
<br>
Complete logs for all build steps: <a href="http://autobuilder.yoctoproject.org/main/builders/nightly-x86-64/builds/23">http://autobuilder.yoctoproject.org/main/builders/nightly-x86-64/builds/23</a>
<br>
Build Reason: Triggerable(trigger_main-build)
<br>
Build Properties:<br>
<ul>
<li>Contents of bblayers.conf (Note. LCONF_VERSION will not show up correctly)<br><code>
LCONF_VERSION = <LCONF> <br>
BBPATH = "${TOPDIR}" <br>
BBFILES ?="" <br>
BBLAYERS += " \ <br>
/home/pokybuild/yocto-autobuilder/yocto-slave/nightly-x86-64/build/meta \ <br>
/home/pokybuild/yocto-autobuilder/yocto-slave/nightly-x86-64/build/meta-yocto \ <br>
/home/pokybuild/yocto-autobuilder/yocto-slave/nightly-x86-64/build/meta-yocto-bsp \ <br>
/home/pokybuild/yocto-autobuilder/yocto-slave/nightly-x86-64/build/meta-qt3 \ <br>
" <br>
<br></code></li>
<li>DEST : /srv/www/vhosts/autobuilder.yoctoproject.org/pub/nightly/20140330-2</li>
<li>Contents of auto.conf (local.conf for autobuilders)<br><code>
DISTRO = "poky"<br>
PACKAGE_CLASSES = "package_rpm package_deb package_ipk"<br>
BB_NUMBER_THREADS = "16"<br>
PARALLEL_MAKE = "-j 16"<br>
SDKMACHINE ?= "x86_64"<br>
BB_TASK_NICE_LEVEL = "5"<br>
BB_TASK_NICE_LEVEL_task-testimage = "0"<br>
DL_DIR = "/srv/www/vhosts/autobuilder.yoctoproject.org/current_sources"<br>
SSTATE_DIR ?= "/srv/www/vhosts/autobuilder.yoctoproject.org/pub/sstate/" <br>
MACHINE = "qemux86-64"<br>
PREMIRRORS = ""<br>
ADTREPO = "http://adtrepo.yoctoproject.org//1.5.1"<br>
<br></code></li>
<li>MACHINE : qemux86-64</li>
<li>branch : dora</li>
<li>branch_bitbake : master</li>
<li>branch_eclipse-poky-juno : master</li>
<li>branch_eclipse-poky-kepler : master</li>
<li>branch_meta-fsl-arm : dora</li>
<li>branch_meta-fsl-ppc : dora</li>
<li>branch_meta-intel : dora</li>
<li>branch_meta-minnow : dora</li>
<li>branch_meta-qt3 : dora</li>
<li>branch_oecore : dora</li>
<li>branch_poky : dora</li>
<li>builddir : /home/pokybuild/yocto-autobuilder/yocto-slave/nightly-x86-64</li>
<li>buildername : nightly-x86-64</li>
<li>buildnumber : 23</li>
<li>commit-description : 1.6_M3.final</li>
<li>commit_bitbake : f4ebc4de63d64e3b5f87e1d0f51507760c3d82d7</li>
<li>commit_eclipse-poky-juno : 26bfc407781aa185f244a47ba63120343cee4a37</li>
<li>commit_eclipse-poky-kepler : 1dfe1d2f1322b5fda8e1a7637c447b0e060efb3e</li>
<li>commit_meta-fsl-arm : 5fdb620c09df11e70434092f675c891e0ba84108</li>
<li>commit_meta-fsl-ppc : 40465bac88ca28b554cff35346341d19552548bf</li>
<li>commit_meta-intel : c87883c7509b8ae55b71055ff05e233cddb71d5d</li>
<li>commit_meta-minnow : e3cddd01e37bd4188bbcd855dbb754ea3701aca4</li>
<li>commit_meta-qt3 : 4772424ab69908d4e3b9d6d4717ca889468e6acd</li>
<li>commit_oecore : ec8ae16e35fd7db6a5bb12412d50ab6f355b0f6e</li>
<li>commit_poky : f1276b066223e7f501f7f711680215ff8edee252</li>
<li>commit_resolvedhead_bitbake : f4ebc4de63d64e3b5f87e1d0f51507760c3d82d7</li>
<li>commit_resolvedhead_eclipse-poky-juno : 26bfc407781aa185f244a47ba63120343cee4a37</li>
<li>commit_resolvedhead_eclipse-poky-kepler : 1dfe1d2f1322b5fda8e1a7637c447b0e060efb3e</li>
<li>commit_resolvedhead_meta-fsl-arm : 5fdb620c09df11e70434092f675c891e0ba84108</li>
<li>commit_resolvedhead_meta-fsl-ppc : 40465bac88ca28b554cff35346341d19552548bf</li>
<li>commit_resolvedhead_meta-intel : c87883c7509b8ae55b71055ff05e233cddb71d5d</li>
<li>commit_resolvedhead_meta-minnow : e3cddd01e37bd4188bbcd855dbb754ea3701aca4</li>
<li>commit_resolvedhead_meta-qt3 : 4772424ab69908d4e3b9d6d4717ca889468e6acd</li>
<li>commit_resolvedhead_oecore : ec8ae16e35fd7db6a5bb12412d50ab6f355b0f6e</li>
<li>commit_resolvedhead_poky : f1276b066223e7f501f7f711680215ff8edee252</li>
<li>distroversion : 1.5.1</li>
<li>got_revision : f1276b066223e7f501f7f711680215ff8edee252</li>
<li>got_revision_meta-qt3 : 4772424ab69908d4e3b9d6d4717ca889468e6acd</li>
<li>got_revision_poky : f1276b066223e7f501f7f711680215ff8edee252</li>
<li>layerversion_core : 3</li>
<li>layerversion_yoctobsp : 2</li>
<li>repo_bitbake : git://git.openembedded.org/bitbake</li>
<li>repo_eclipse-poky-juno : git://git.yoctoproject.org/eclipse-poky-juno</li>
<li>repo_eclipse-poky-kepler : git://git.yoctoproject.org/eclipse-poky-kepler</li>
<li>repo_meta-fsl-arm : git://git.yoctoproject.org/meta-fsl-arm</li>
<li>repo_meta-fsl-ppc : git://git.yoctoproject.org/meta-fsl-ppc</li>
<li>repo_meta-intel : git://git.yoctoproject.org/meta-intel</li>
<li>repo_meta-minnow : git://git.yoctoproject.org/meta-minnow</li>
<li>repo_meta-qt3 : git://git.yoctoproject.org/meta-qt3</li>
<li>repo_oecore : git://git.openembedded.org/openembedded-core</li>
<li>repo_poky : git://git.yoctoproject.org/poky</li>
<li>repository : git://git.yoctoproject.org/poky</li>
<li>repourl_meta-qt3 : git://git.yoctoproject.org/meta-qt3</li>
<li>repourl_poky : git://git.yoctoproject.org/poky</li>
<li>revision : f1276b066223e7f501f7f711680215ff8edee252</li>
<li>scheduler : trigger_main-build</li>
<li>slavename : ab05.i.yoctoproject.org</li>
<li>workdir : /home/pokybuild/yocto-autobuilder/yocto-slave/nightly-x86-64</li>
</ul>
<i>Detailed log of last build step:</i> <a href="http://autobuilder.yoctoproject.org/main/builders/nightly-x86-64/builds/23/steps/Running Sanity Tests/logs/stdio">http://autobuilder.yoctoproject.org/main/builders/nightly-x86-64/builds/23/steps/Running Sanity Tests/logs/stdio</a>
<br>
<h4>Last 60 lines of "Running Sanity Tests.stdio" Error log:</h4>
<p>
| test_xorg_error (oeqa.runtime.xorg.XorgTest) ... ok<br>| test_xorg_running (oeqa.runtime.xorg.XorgTest) ... ok<br>| test_scp_file (oeqa.runtime.scp.ScpTest) ... ok<br>| test_vnc (oeqa.runtime.vnc.VNCTest) ... ok<br>| test_date (oeqa.runtime.date.DateTest) ... ok<br>| test_perl_exists (oeqa.runtime.perl.PerlTest) ... ok<br>| test_perl_works (oeqa.runtime.perl.PerlTest) ... ok<br>| test_ldd_exists (oeqa.runtime.ldd.LddTest) ... ok<br>| test_ldd_rtldlist_check (oeqa.runtime.ldd.LddTest) ... ok<br>| test_gcc_compile (oeqa.runtime.gcc.GccCompileTest) ... ok<br>| test_gpp_compile (oeqa.runtime.gcc.GccCompileTest) ... ok<br>| test_make (oeqa.runtime.gcc.GccCompileTest) ... ok<br>| test_rpm_help (oeqa.runtime.rpm.RpmBasicTest) ... ok<br>| test_rpm_query (oeqa.runtime.rpm.RpmBasicTest) ... ok<br>| test_rpm_install (oeqa.runtime.rpm.RpmInstallRemoveTest) ... ok<br>| test_rpm_remove (oeqa.runtime.rpm.RpmInstallRemoveTest) ... ok<br>| test_smart_help (oeqa.runtime.smart.SmartBasicTest) ... ok<
 br>| test_smart_info (oeqa.runtime.smart.SmartBasicTest) ... ok<br>| test_smart_query (oeqa.runtime.smart.SmartBasicTest) ... ok<br>| test_smart_search (oeqa.runtime.smart.SmartBasicTest) ... ok<br>| test_smart_stats (oeqa.runtime.smart.SmartBasicTest) ... ok<br>| test_smart_version (oeqa.runtime.smart.SmartBasicTest) ... ok<br>| test_smart_channel (oeqa.runtime.smart.SmartRepoTest) ... ok<br>| test_smart_channel_add (oeqa.runtime.smart.SmartRepoTest) ... ok<br>| test_smart_channel_help (oeqa.runtime.smart.SmartRepoTest) ... ok<br>| test_smart_channel_list (oeqa.runtime.smart.SmartRepoTest) ... ok<br>| test_smart_channel_rpmsys (oeqa.runtime.smart.SmartRepoTest) ... ok<br>| test_smart_channel_show (oeqa.runtime.smart.SmartRepoTest) ... ok<br>| test_smart_install (oeqa.runtime.smart.SmartRepoTest) ... FAIL<br>| test_smart_install_dependency (oeqa.runtime.smart.SmartRepoTest) ... skipped 'Testcase dependency not met: test_smart_install'<br>| test_smart_install_from_disk (oeqa.runtime.
 smart.SmartRepoTest) ... ok<br>| test_smart_install_from_http (oeqa.runtime.smart.SmartRepoTest) ... ok<br>| test_smart_reinstall (oeqa.runtime.smart.SmartRepoTest) ... skipped 'Testcase dependency not met: test_smart_install'<br>| test_dmesg (oeqa.runtime.dmesg.DmesgTest) ... ok<br>| <br>| ======================================================================<br>| FAIL: test_smart_install (oeqa.runtime.smart.SmartRepoTest)<br>| ----------------------------------------------------------------------<br>| Traceback (most recent call last):<br>|   File "/home/pokybuild/yocto-autobuilder/yocto-slave/nightly-x86-64/build/meta/lib/oeqa/utils/decorators.py", line 48, in wrapped_f<br>|     return f(*args)<br>|   File "/home/pokybuild/yocto-autobuilder/yocto-slave/nightly-x86-64/build/meta/lib/oeqa/runtime/smart.py", line 84, in test_smart_install<br>|     self.smart('remove -y psplash-default')<br>|   File "/home/pokybuild/yocto-autobuilder/yocto-slave/nightly-x86-64/build/meta/lib/oeqa/uti
 ls/decorators.py", line 48, in wrapped_f<br>|     return f(*args)<br>|   File "/home/pokybuild/yocto-autobuilder/yocto-slave/nightly-x86-64/build/meta/lib/oeqa/runtime/smart.py", line 20, in smart<br>|     self.assertEqual(status, expected, message)<br>| AssertionError: 255 != 0 : smart remove -y psplash-default<br>| <br>| [!!! SSH command timed out after 1500 seconds and it was killed]<br>| <br>| ----------------------------------------------------------------------<br>| Ran 45 tests in 2638.074s<br>| <br>| FAILED (failures=1, skipped=2)<br>| NOTE: Sending SIGTERM to runqemu<br>| DEBUG: Python function do_testimage finished<br>| ERROR: Function failed: core-image-sato-sdk - FAILED - check the task log and the ssh log<br>ERROR: Task 2 (/home/pokybuild/yocto-autobuilder/yocto-slave/nightly-x86-64/build/meta/recipes-sato/images/core-image-sato-sdk.bb, do_testimage) failed with exit code '1'<br>Summary: There was 1 ERROR message shown, returning a non-zero exit code.
</p>
<br><br>
<b>-The Yocto BuildBot</b>