<h4>Build status: FAILURE</h4>
Buildslave for this Build: <b>ab10.i.yoctoproject.org</b>
<br>
Complete logs for all build steps: <a href="http://autobuilder.yoctoproject.org:8011/builders/nightly-mips/builds/351">http://autobuilder.yoctoproject.org:8011/builders/nightly-mips/builds/351</a>
<br>
Build Reason: Triggerable(trigger_nightly-mips)
<br>
Build Properties:<br>
<ul>
<li>Contents of bblayers.conf (Note. LCONF_VERSION will not show up correctly)<br><code>
LCONF_VERSION = <LCONF> <br>
BBPATH = "${TOPDIR}" <br>
BBFILES ?="" <br>
BBLAYERS += " \ <br>
/home/pokybuild/yocto-autobuilder/yocto-slave/nightly-mips/build/meta \ <br>
/home/pokybuild/yocto-autobuilder/yocto-slave/nightly-mips/build/meta-yocto \ <br>
/home/pokybuild/yocto-autobuilder/yocto-slave/nightly-mips/build/meta-yocto-bsp \ <br>
/home/pokybuild/yocto-autobuilder/yocto-slave/nightly-mips/build/meta-qt3 \ <br>
" <br>
<br></code></li>
<li>DEST : /srv/www/vhosts/autobuilder.yoctoproject.org/pub/nightly/20131104-1</li>
<li>Contents of auto.conf (local.conf for autobuilders)<br><code>
DISTRO = "poky"<br>
PACKAGE_CLASSES = "package_rpm package_deb package_ipk"<br>
BB_NUMBER_THREADS = "16"<br>
PARALLEL_MAKE = "-j 16"<br>
SDKMACHINE ?= "x86-64"<br>
BB_TASK_NICE_LEVEL = "5"<br>
BB_TASK_NICE_LEVEL_task-testimage = "0"<br>
DL_DIR = "/srv/www/vhosts/autobuilder.yoctoproject.org/current_sources"<br>
SSTATE_DIR ?= "/srv/www/vhosts/sstate.yoctoproject.org//" <br>
MACHINE = "qemumips"<br>
PREMIRRORS = ""<br>
BB_GENERATE_MIRROR_TARBALLS = "1"<br>
ADTREPO = "http://adtrepo.yoctoproject.org//1.5+snapshot"<br>
<br></code></li>
<li>MACHINE : qemumips</li>
<li>branch : master</li>
<li>branch_meta-qt3 : master</li>
<li>branch_poky : master</li>
<li>buildername : nightly-mips</li>
<li>buildnumber : 351</li>
<li>commit-description : poky-10.0.0.final</li>
<li>commit_meta-qt3 : b73552fb998fd30a01dbee5a172e432a16078222</li>
<li>commit_poky : 9160f376065752e2e92c8b37ee9a80d0eb86b53b</li>
<li>commit_resolvedhead_bitbake : 029e868044989eda370340f8bf4200cfd2670fca</li>
<li>commit_resolvedhead_eclipse-poky-juno : 7b50b0cee840092b4a575c239ddf11ba50d78327</li>
<li>commit_resolvedhead_eclipse-poky-kepler : 84c1361ee96b781666a23f068244d4f1252be712</li>
<li>commit_resolvedhead_meta-fsl-arm : b91173244b4b7a3d5e90ea21e67db18640358d1b</li>
<li>commit_resolvedhead_meta-fsl-ppc : 768c6ef13546e0f977847bc1fbb5957571fbf724</li>
<li>commit_resolvedhead_meta-intel : cef90890a6cf4ce1e8e746ca01bec3bc55d307e5</li>
<li>commit_resolvedhead_meta-minnow : 57459d0753d3b6e25b3ac431496eafa5e668d6fa</li>
<li>commit_resolvedhead_meta-qt3 : b73552fb998fd30a01dbee5a172e432a16078222</li>
<li>commit_resolvedhead_oecore : 1d2d37d579492b63d20ff8aa890a43b9a1576cf0</li>
<li>commit_resolvedhead_poky : 9160f376065752e2e92c8b37ee9a80d0eb86b53b</li>
<li>distroversion : 1.5+snapshot</li>
<li>got_revision : 9160f376065752e2e92c8b37ee9a80d0eb86b53b</li>
<li>got_revision_meta-qt3 : b73552fb998fd30a01dbee5a172e432a16078222</li>
<li>got_revision_poky : 9160f376065752e2e92c8b37ee9a80d0eb86b53b</li>
<li>layerversion_core : 3</li>
<li>layerversion_yoctobsp : 2</li>
<li>repository : git://git.yoctoproject.org/poky</li>
<li>repourl_meta-qt3 : git://git.yoctoproject.org/meta-qt3</li>
<li>repourl_poky : git://git.yoctoproject.org/poky</li>
<li>revision : 9160f376065752e2e92c8b37ee9a80d0eb86b53b</li>
<li>scheduler : trigger_nightly-mips</li>
<li>slavename : ab10.i.yoctoproject.org</li>
<li>workdir : /home/pokybuild/yocto-autobuilder/yocto-slave/nightly-mips</li>
</ul>
<i>Detailed log of last build step:</i> <a href="http://autobuilder.yoctoproject.org:8011/builders/nightly-mips/builds/351/steps/Running Sanity Tests/logs/stdio">http://autobuilder.yoctoproject.org:8011/builders/nightly-mips/builds/351/steps/Running Sanity Tests/logs/stdio</a>
<br>
<h4>Last 60 lines of "Running Sanity Tests.stdio" Error log:</h4>
<p>
| test_smart_channel_rpmsys (oeqa.runtime.smart.SmartRepoTest) ... ok<br>| test_smart_channel_show (oeqa.runtime.smart.SmartRepoTest) ... ok<br>| test_smart_install (oeqa.runtime.smart.SmartRepoTest) ... ok<br>| test_smart_install_dependency (oeqa.runtime.smart.SmartRepoTest) ... ok<br>| test_smart_install_from_disk (oeqa.runtime.smart.SmartRepoTest) ... ok<br>| test_smart_install_from_http (oeqa.runtime.smart.SmartRepoTest) ... ok<br>| test_smart_reinstall (oeqa.runtime.smart.SmartRepoTest) ... ok<br>| test_kernel_module (oeqa.runtime.kernelmodule.KernelModuleTest) ... FAIL<br>| test_dmesg (oeqa.runtime.dmesg.DmesgTest) ... ok<br>| <br>| ======================================================================<br>| FAIL: test_kernel_module (oeqa.runtime.kernelmodule.KernelModuleTest)<br>| ----------------------------------------------------------------------<br>| Traceback (most recent call last):<br>|   File "/home/pokybuild/yocto-autobuilder/yocto-slave/nightly-mips/build/meta/lib/oeqa/utils/decorators.py", line 48, in wrapped_f<br>|     return f(*args)<br>|   File "/home/pokybuild/yocto-autobuilder/yocto-slave/nightly-mips/build/meta/lib/oeqa/utils/decorators.py", line 48, in wrapped_f<br>|     return f(*args)<br>|   File "/home/pokybuild/yocto-autobuilder/yocto-slave/nightly-mips/build/meta/lib/oeqa/runtime/kernelmodule.py", line 30, in test_kernel_module<br>|     self.assertEqual(status, 0, msg="\n".join([cmd, output]))<br>| AssertionError: 255 != 0 : cd /usr/src/kernel && make scripts<br>|   HOSTCC  scripts/basic/fixdep<br>|   HOSTCC  scripts/kconfig/conf.o<br>|   SHIPPED scripts/kconfig/zconf.tab.c<br>|   SHIPPED scripts/kconfig/zconf.lex.c<br>|   SHIPPED scripts/kconfig/zconf.hash.c<br>|   HOSTCC  scripts/kconfig/zconf.tab.o<br>| In file included from scripts/kconfig/zconf.tab.c:2503:0:<br>| scripts/kconfig/menu.c: In function 'get_symbol_str':<br>| scripts/kconfig/menu.c:567:18: warning: 'jump' may be used uninitialized in this function [-Wmaybe-uninitialized]<br>|      jump->offset = r->len - 1;<br>|                   ^<br>| scripts/kconfig/menu.c:528:19: note: 'jump' was declared here<br>|   struct jump_key *jump;<br>|                    ^<br>|   HOSTLD  scripts/kconfig/conf<br>| scripts/kconfig/conf --silentoldconfig Kconfig<br>|   CC      scripts/mod/empty.o<br>|   HOSTCC  scripts/mod/mk_elfconfig<br>|   MKELF   scripts/mod/elfconfig.h<br>|   CC      scripts/mod/devicetable-offsets.s<br>|   GEN     scripts/mod/devicetable-offsets.h<br>|   HOSTCC  scripts/mod/file2alias.o<br>|   HOSTCC  scripts/mod/modpost.o<br>|   HOSTCC  scripts/mod/sumversion.o<br>|   HOSTLD  scripts/mod/modpost<br>|   HOSTCC  scripts/kallsyms<br>|   HOSTCC  scripts/conmakehash<br>| <br>| [!!! SSH command timed out after 900 seconds and it was killed]<br>| <br>| ----------------------------------------------------------------------<br>| Ran 46 tests in 4151.238s<br>| <br>| FAILED (failures=1)<br>| NOTE: Sending SIGTERM to runqemu<br>| DEBUG: Python function do_testimage finished<br>| ERROR: Function failed: core-image-sato-sdk - FAILED - check the task log and the ssh log<br>ERROR: Task 2 (/home/pokybuild/yocto-autobuilder/yocto-slave/nightly-mips/build/meta/recipes-sato/images/core-image-sato-sdk.bb, do_testimage) failed with exit code '1'<br>Summary: There was 1 ERROR message shown, returning a non-zero exit code.
</p>
<br><br>
<b>-The Yocto BuildBot</b>